program: Gaussian 09
title: 000299700
version: EM64L-G09RevD.01
frameworkgroup: C1[X(C9H17NO)]
method: RPBEPBE
basis: SDD
operation: Freq
keyword: #p
keyword: freq=noraman
keyword: PBEPBE/SDD
title: #p freq=noraman PBEPBE/SDD
converged: YES YES NO NO
title: Mulliken charges:
elementType: O N C C C C C C C C C H H H H H H H H H H H H H H H H H
charge: -0.272683 -0.353033 0.025035 -0.439068 -0.434150 -0.398954 -0.400842 -0.385128 -0.462322 0.236561 -0.773533 0.234398 0.181221 0.196644 0.208102 0.183868 0.196480 0.195225 0.197969 0.197484 0.200904 0.187002 0.214931 0.255090 0.296049 0.253857 0.207419 0.251475
chargesum: 0.00000
title: Mulliken charges with hydrogens summed into heavy atoms:
elementType: O N C C C C C C C C C
charge: -0.272683 -0.056984 0.259432 -0.061203 -0.042180 -0.007250 -0.005390 0.002778 0.007699 0.236561 -0.060782
polarizability: 1.24011415e+02 -2.60024813e+00 9.92606942e+01 4.85686106e+00 3.38545854e+00 8.88991515e+01
1716.lowfreq: -15.8079 -0.0005 0.0006 0.0009 8.8437 9.7682 27.6484 48.4711 69.1318
frequency: 27.4915 48.3455 69.1275 86.2488 128.6407 217.4793 223.9148 275.2204 296.8124 319.8872 407.5363 429.5048 436.2166 475.7599 519.5254 555.2525 600.8322 623.6251 770.5702 785.0586 813.6138 840.9775 875.4502 893.8263 912.9217 954.0153 968.6945 983.6704 1040.4167 1047.2299 1059.7533 1064.8833 1087.6683 1107.0072 1118.6397 1148.9431 1187.4248 1219.4753 1253.1085 1254.4316 1259.6552 1273.0609 1295.1350 1313.7524 1334.6993 1338.0704 1339.9065 1341.2209 1357.9132 1368.4863 1385.7695 1441.1964 1449.6996 1459.2216 1462.4779 1463.0725 1467.4909 1468.2575 1475.1367 1490.2121 1620.4415 2941.6767 2950.4404 2963.6805 2967.0171 2967.9696 2971.3331 2987.8711 2994.1426 3011.8119 3021.5173 3026.5130 3028.8136 3040.7069 3062.5975 3095.8108 3098.3179 3564.2462
redmass: 4.7427 3.1788 2.2231 1.2859 2.7978 2.7575 2.2601 2.4837 3.4701 1.7468 2.1466 2.7901 2.2860 2.5409 1.5079 1.6042 2.6817 3.4081 2.5724 1.4801 1.8882 2.3104 2.1325 1.5441 1.8264 2.3532 1.5659 2.0055 1.6617 2.0156 1.1006 2.2525 1.4867 3.1193 2.7960 2.3570 1.5225 1.3354 1.4610 1.5561 1.2606 1.3232 1.2131 1.2858 1.3678 1.3901 1.4908 1.4886 1.4894 1.3491 1.2340 1.1303 1.0459 1.0882 1.0950 1.0901 1.0883 1.0804 1.1041 1.8118 6.2499 1.0623 1.0638 1.0619 1.0631 1.0639 1.0770 1.0661 1.0361 1.0962 1.0984 1.0944 1.1024 1.1036 1.1006 1.1002 1.0982 1.0780
irintensity: 7.0675 1.8959 7.9416 0.3087 0.8111 2.0355 0.8426 3.3349 0.6329 1.7399 1.5439 2.5594 2.6865 20.9121 31.1047 84.4152 3.5659 0.2344 1.2840 0.0926 1.9232 4.2390 4.9747 10.9781 0.6769 15.5126 0.5754 8.6626 13.8929 1.0504 0.0209 0.5022 2.7910 4.3156 1.2930 0.4451 1.8904 1.5081 20.1980 62.6006 2.4028 20.3165 12.4135 15.9281 0.6542 5.3167 0.1660 0.9205 0.9606 0.4114 56.7631 32.1682 13.7658 2.6605 18.0537 9.7555 18.0572 38.1544 0.1220 173.0869 178.2243 31.3746 32.6078 34.7975 27.7140 30.8869 3.2811 45.3536 13.4366 89.3520 45.1224 55.2445 24.8350 128.7436 14.5168 22.5069 11.1272 12.0995
temp: 298.150 k
press: 1.00000 atm
elementType: 8 7 6 6 6 6 6 6 6 6 6 1 1 1 1 1 1 1 1 1 1 1 1 1 1 1 1 1
symmnumber: 1
zpe: 653331.8 jmol-1
zpe.correction: 0.248841 hartree
zpe.thermalcorrener: 0.260811 hartree
zpe.thermalcorrenthalpy: 0.261755 hartree
zpe.thermalcorrgfe: 0.209577 hartree
zpe.sumelectzpe: -482.262963 hartree
zpe.sumelectthermal: -482.250993 hartree
zpe.sumelectthermalent: -482.250049 hartree
zpe.sumelectthermalfe: -482.302227 hartree
dipole: 1.1422 3.0334 2.2226
dipole: 3.9302
quadrupole: -69.2821 -70.2255 -68.4659
quadrupole: -9.9969 -4.8724 -1.8167
quadrupole: 0.0424 -0.9010 0.8586 -9.9969 -4.8724 -1.8167
hfenergy: -482.5118041 hartree
pointgroup: C01 [X(C9H17N1O1)]
dipole: 0.451379 1.1058578 0.9819339 debye
polarizability: 123.9461626|-3.1784828|98.5856984|4.744063|4.240764|89.6394 unknown
InChI: InChI=1S/C9H17NO/c1-8(11)10-7-9-5-3-2-4-6-9/h9-10H,2-7H2,1H3
charge 0 multiplicity 1
28 atoms
O  -2.789149 -1.057299 -0.964634
N  -1.842887 0.200156 0.748784
C  0.563961 -0.254034 0.0922
C  1.093573 1.138714 0.51717
C  1.68254 -1.31959 0.219905
C  2.35756 1.541864 -0.279999
C  2.949203 -0.92247 -0.575043
C  3.467828 0.472006 -0.150135
C  -0.677839 -0.686773 0.911932
C  -2.824847 -0.044308 -0.200266
C  -3.956219 0.981093 -0.259494
H  0.254919 -0.202665 -0.973039
H  1.340045 1.114383 1.601561
H  0.303989 1.904498 0.379414
H  1.305985 -2.301399 -0.129344
H  1.948831 -1.439524 1.292549
H  2.72946 2.525643 0.067244
H  2.089196 1.659384 -1.350313
H  2.708342 -0.906543 -1.658028
H  3.739888 -1.684982 -0.434334
H  4.347238 0.756136 -0.760248
H  3.80967 0.428354 0.90525
H  -0.417089 -0.733744 1.988229
H  -0.997323 -1.693027 0.585752
H  -1.906423 1.04135 1.322418
H  -4.916948 0.465703 -0.088482
H  -3.853877 1.798563 0.475714
H  -3.995928 1.415611 -1.273359
