program: Gaussian 09
title: 000299698
version: EM64L-G09RevD.01
frameworkgroup: C1[X(C10H12F4S)]
method: RPBEPBE
basis: SDD
operation: Freq
keyword: #p
keyword: freq=noraman
keyword: PBEPBE/SDD
title: #p freq=noraman PBEPBE/SDD
converged: NO YES NO NO
title: Mulliken charges:
elementType: S F F F F C C C C C C C C C C H H H H H H H H H H H H
charge: 0.305024 -0.162777 -0.162749 -0.127443 -0.155632 -0.045728 -0.607566 0.278270 -0.423660 -0.330103 -0.093989 -0.483873 -0.476968 -0.154611 -0.183768 0.262426 0.316648 0.238014 0.243413 0.245667 0.221306 0.215479 0.208346 0.209063 0.221323 0.221919 0.221972
chargesum: 0.00000
title: Mulliken charges with hydrogens summed into heavy atoms:
elementType: S F F F F C C C C C C C C C C
charge: 0.305024 -0.162777 -0.162749 -0.127443 -0.155632 0.216698 -0.290919 0.278270 0.057767 0.136870 -0.093989 -0.060048 -0.046582 0.067308 0.038203
polarizability: 1.36194767e+02 -3.83330151e-01 1.23755240e+02 1.62051569e+00 9.62639283e-01 9.58316699e+01
1716.lowfreq: -10.6215 -0.0007 0.0018 0.0022 1.4619 8.8905 45.1944 64.3175 102.1267
frequency: 45.1224 64.2791 102.1122 167.4544 186.4436 203.9647 218.3762 243.1631 247.1452 267.0464 290.2981 310.7208 315.5310 347.7901 385.4619 393.7345 425.1340 468.8303 492.2402 529.1663 544.4897 551.8560 585.9021 666.6877 732.7406 757.1782 794.3001 836.8574 855.3481 876.4423 888.4409 937.8776 941.7288 959.4619 978.3115 994.4061 1010.0494 1015.8468 1048.1050 1084.2590 1100.9383 1115.7361 1138.7308 1148.9754 1178.6629 1193.1424 1206.1644 1229.3973 1253.1105 1264.0818 1290.7914 1302.4228 1319.5407 1324.0987 1330.7950 1346.0716 1360.3292 1389.7086 1462.5865 1464.4560 1467.5226 1485.6087 1667.7834 2980.6500 2988.8708 2993.1932 2993.7379 3011.2271 3040.7620 3042.5241 3055.3516 3061.1612 3080.1329 3089.5417 3122.1200
redmass: 5.7828 7.7126 4.2301 6.1181 3.5244 4.2378 7.3028 4.5076 6.3469 4.7974 13.6256 2.9290 2.9492 5.2846 5.8372 8.8579 6.7210 2.4119 5.9961 3.2147 9.8381 7.8055 2.1631 4.0162 1.6131 3.4695 2.3282 2.0883 4.9359 2.5068 2.6385 6.4152 2.7510 3.7573 1.3425 1.8701 3.5975 3.1899 3.5729 3.2378 2.4409 2.3498 1.4280 2.5340 1.3752 3.9971 1.3593 1.3031 1.1947 1.1915 1.2976 1.3282 1.2828 1.2343 1.3484 1.3486 1.3497 1.4977 1.0861 1.0881 1.1080 1.0940 6.7803 1.0620 1.0586 1.0622 1.0623 1.0833 1.0979 1.0984 1.1008 1.1015 1.0894 1.0851 1.0989
irintensity: 0.3242 0.4119 0.8497 0.7862 1.2461 1.8986 0.4921 1.2078 0.3634 1.1393 1.1325 0.7317 0.8711 3.3145 1.5773 5.2948 1.3126 4.3870 0.3457 0.8667 1.9334 10.0393 2.3457 29.8752 67.1735 4.9092 6.6528 7.0733 56.1389 7.7997 41.6811 134.7503 36.6062 62.0680 4.4737 8.1432 55.7558 23.0908 77.0407 17.7032 2.3535 2.1576 36.1311 40.2670 8.7747 54.5360 12.1840 3.8853 2.5130 3.5655 3.0847 7.7546 9.2379 3.3723 6.7486 1.1627 3.2383 0.5811 4.9448 9.0964 8.6085 27.5013 2.7042 33.4439 17.3175 25.9729 14.6713 1.8007 40.0822 4.6819 21.1892 14.0603 12.3848 9.9527 51.0623
temp: 298.150 k
press: 1.00000 atm
elementType: 16 9 9 9 9 6 6 6 6 6 6 6 6 6 6 1 1 1 1 1 1 1 1 1 1 1 1
symmnumber: 1
zpe: 533918.7 jmol-1
zpe.correction: 0.203359 hartree
zpe.thermalcorrener: 0.217339 hartree
zpe.thermalcorrenthalpy: 0.218284 hartree
zpe.thermalcorrgfe: 0.162990 hartree
zpe.sumelectzpe: -1184.516003 hartree
zpe.sumelectthermal: -1184.502023 hartree
zpe.sumelectthermalent: -1184.501079 hartree
zpe.sumelectthermalfe: -1184.556372 hartree
dipole: -5.3459 -0.7068 -0.0873
dipole: 5.3932
quadrupole: -101.9342 -93.2843 -96.0449
quadrupole: -0.7652 0.6303 0.1100
quadrupole: -4.8464 3.8035 1.0429 -0.7652 0.6303 0.1100
hfenergy: -1184.7193622 hartree
pointgroup: C01 [X(C10H12F4S1)]
dipole: -2.1145991 -0.1738464 -0.0208471 debye
polarizability: 136.1689277|-1.0808638|123.3186469|0.9455687|3.8300039|96.2941016 unknown
InChI: InChI=1S/C10H12F4S/c11-9(12)7-5-3-1-2-4-6-8(7)15-10(9,13)14/h1-2,7-8H,3-6H2
charge 0 multiplicity 1
27 atoms
S  1.255347 -1.656311 -1.167883
F  1.690414 1.509867 -1.094762
F  1.911514 1.557105 1.168984
F  3.550471 -0.391362 -0.450398
F  2.319589 -1.139244 1.309401
C  -0.069802 0.443473 0.251402
C  -0.412566 -0.832385 -0.585196
C  1.426313 0.751415 0.092698
C  -0.911254 1.70496 -0.096504
C  -1.224908 -1.907889 0.166298
C  2.222991 -0.577075 -0.012243
C  -2.396591 1.66714 0.364812
C  -2.570596 -1.386265 0.7590
C  -3.297144 0.735467 -0.433757
C  -3.394139 -0.609702 -0.249532
H  -0.203743 0.202704 1.324405
H  -0.910039 -0.541601 -1.523527
H  -0.859865 1.885163 -1.185611
H  -0.424791 2.571419 0.393062
H  -0.607212 -2.327387 0.983015
H  -1.432602 -2.737952 -0.536355
H  -2.79147 2.697035 0.283883
H  -2.427758 1.408813 1.442308
H  -2.355687 -0.751845 1.640399
H  -3.137995 -2.259625 1.130829
H  -3.902485 1.201721 -1.223952
H  -4.069391 -1.187539 -0.896574
