program: Gaussian 09
title: 000299682
version: EM64L-G09RevD.01
frameworkgroup: C1[X(C14H16Br2N2O)]
method: RPBEPBE
basis: SDD
operation: Freq
keyword: #p
keyword: freq=noraman
keyword: PBEPBE/SDD
title: #p freq=noraman PBEPBE/SDD
converged: YES YES NO NO
title: Mulliken charges:
elementType: Br Br O N N C C C C C C C C C C C C C C H H H H H H H H H H H H H H H H
charge: 0.050426 0.079681 -0.290648 -0.501344 -0.419319 -0.429188 -0.412061 -0.539814 -0.538478 0.063019 0.344272 0.320741 -0.431823 -0.374676 -0.239820 0.318214 -0.440799 0.131027 -0.561473 0.211157 0.208591 0.209859 0.206553 0.223631 0.201442 0.217265 0.225277 0.231770 0.306893 0.224470 0.310735 0.294649 0.293294 0.237094 0.269381
chargesum: 0.00000
title: Mulliken charges with hydrogens summed into heavy atoms:
elementType: Br Br O N N C C C C C C C C C C C C C C
charge: 0.050426 0.079681 -0.290648 -0.190610 -0.124671 -0.009440 0.004351 -0.114740 -0.095936 0.063019 0.344272 0.320741 -0.200053 -0.067783 -0.015350 0.318214 0.089590 0.131027 -0.292092
polarizability: 2.99497474e+02 1.62458756e+01 1.83027674e+02 -2.64240363e+01 -3.12739121e+00 1.41941682e+02
1716.lowfreq: -5.6178 -0.0004 -0.0003 0.0004 1.5187 4.8745 14.3091 18.4103 19.5726
frequency: 12.9706 17.6810 19.5620 52.6701 65.4607 97.7270 103.5808 106.7667 135.4885 151.6392 173.4041 219.6731 225.0673 259.9294 287.8878 303.4174 308.7732 353.2195 392.4726 403.0036 416.9138 438.5765 451.5609 475.7619 495.8106 540.8171 563.1416 577.6653 593.3565 605.9907 668.5749 704.6399 716.1666 717.0370 757.8480 769.5825 786.9937 797.4106 842.6805 867.1837 883.4531 908.2963 926.9457 940.1546 983.0767 989.0957 1013.2529 1026.4495 1060.1087 1080.3315 1086.9337 1105.7789 1138.4692 1141.7934 1162.7971 1183.3112 1188.1464 1204.3219 1212.0086 1226.9559 1245.9175 1255.4751 1274.7870 1293.9715 1325.2983 1337.5215 1341.1488 1347.1107 1358.3109 1377.2686 1433.1509 1456.6716 1457.6612 1462.8651 1464.9500 1472.4931 1475.3551 1477.0017 1527.2861 1600.3863 1609.9307 1611.0516 1646.0439 2919.6331 2959.5171 2959.7520 2970.5744 2982.2042 2986.5973 3025.7383 3041.9262 3042.4270 3050.5246 3118.7311 3147.3106 3165.3645 3195.1357 3539.6343 3553.6636
redmass: 5.8984 10.7186 11.5025 5.7863 6.1334 5.7484 2.6519 16.4222 3.1087 8.8208 4.0166 4.3618 2.9991 4.8556 2.5689 3.6080 1.8313 2.3106 2.4110 3.7757 3.6552 3.7786 3.2669 6.3033 3.4885 2.5859 4.2101 1.8902 2.8224 2.5552 5.1826 10.1245 3.4294 3.2255 2.2494 1.9964 2.0767 1.9285 1.5937 3.1397 2.3810 1.4426 1.4519 2.9557 2.4987 1.3139 2.4189 3.9064 3.5792 2.1788 1.9926 1.5839 1.1540 3.2942 1.3716 2.2368 1.2835 1.2878 1.7923 1.6438 1.2062 1.2780 1.2386 2.4541 1.5883 1.5393 1.2983 1.4202 1.6297 3.9058 2.4831 1.3341 1.0745 1.1647 1.8187 1.1084 1.8472 1.1188 2.1503 6.7259 6.2054 8.2230 4.0503 1.0579 1.0819 1.0794 1.0631 1.0624 1.0658 1.0946 1.0989 1.0968 1.1044 1.0875 1.0953 1.0925 1.0947 1.0758 1.0771
irintensity: 0.2496 0.2173 0.2809 2.4123 9.0088 1.4280 0.1345 0.5109 0.7402 0.5898 1.6250 5.4582 3.0732 4.1335 5.8701 6.8198 0.4141 16.3115 20.7994 0.2502 47.6589 1.0580 0.1536 17.8753 1.7197 30.7801 28.0346 69.1950 38.9671 23.7577 2.9951 11.6331 30.4807 22.3155 24.7578 27.6007 24.2686 34.7555 14.7445 3.5010 8.5334 6.1581 1.2984 18.7769 1.0473 4.3215 7.2426 10.1258 18.3162 15.4710 8.6702 2.7925 3.1560 14.9671 1.8264 67.7137 4.7204 5.3531 372.6151 21.9073 57.9562 6.9123 0.9846 65.5743 1.3415 1.2220 2.9602 1.0727 5.2145 102.0415 39.4375 46.5069 29.0640 23.2906 117.1602 12.4753 420.6279 40.3410 533.5887 106.6939 28.1440 31.3947 114.5336 43.1719 24.8965 22.0594 63.1090 32.3383 52.7703 33.4653 63.7938 18.7135 63.3909 10.0410 29.5739 17.3557 8.2839 26.0059 18.8659
temp: 298.150 k
press: 1.00000 atm
elementType: 35 35 8 7 7 6 6 6 6 6 6 6 6 6 6 6 6 6 6 1 1 1 1 1 1 1 1 1 1 1 1 1 1 1 1
symmnumber: 1
zpe: 720452.1 jmol-1
zpe.correction: 0.274406 hartree
zpe.thermalcorrener: 0.293318 hartree
zpe.thermalcorrenthalpy: 0.294262 hartree
zpe.thermalcorrgfe: 0.222258 hartree
zpe.sumelectzpe: -753.342132 hartree
zpe.sumelectthermal: -753.323220 hartree
zpe.sumelectthermalent: -753.322276 hartree
zpe.sumelectthermalfe: -753.394279 hartree
dipole: -1.1858 4.1211 -2.3903
dipole: 4.9095
quadrupole: -125.6459 -133.1704 -127.6708
quadrupole: -8.2758 -7.9646 -2.1919
quadrupole: 3.1831 -4.3414 1.1582 -8.2758 -7.9646 -2.1919
hfenergy: -753.6165376 hartree
pointgroup: C01 [X(C14H16Br2N2O1)]
dipole: -0.6229312 -1.7456149 0.5437208 debye
polarizability: 295.4030574|-35.2793059|188.783346|4.4845338|9.460121|140.2804263 unknown
InChI: InChI=1S/C14H16Br2N2O/c15-8-11(16)9-17-14(19)18-13-7-3-5-10-4-1-2-6-12(10)13/h3,5,7-8,17-18H,1-2,4,6,9H2
charge 0 multiplicity 1
35 atoms
Br 4.109517 0.088828 -2.026174
Br 6.988881 -1.83209 -1.145164
O  1.459779 1.911142 0.800102
N  0.008176 0.073436 0.426794
N  2.302154 -0.264521 0.744475
C  -3.521784 -2.461562 -0.076811
C  -4.583461 -1.766638 -0.952351
C  -2.20352 -1.652996 -0.066305
C  -4.924315 -0.3905 -0.345921
C  -2.401067 -0.142806 0.089153
C  -3.68531 0.450517 -0.041239
C  -1.270854 0.702033 0.344642
C  -3.831428 1.852351 0.111059
C  -1.427453 2.101335 0.501158
C  -2.714838 2.664557 0.387852
C  1.252951 0.668397 0.664004
C  3.684511 0.190953 0.878308
C  4.608024 -0.366889 -0.194194
C  5.701792 -1.108758 0.10451
H  -3.320881 -3.488687 -0.435222
H  -3.912172 -2.547928 0.956803
H  -5.495724 -2.388341 -1.022999
H  -4.190909 -1.640787 -1.981291
H  -1.654327 -1.856391 -1.012882
H  -1.569812 -2.045662 0.759044
H  -5.498356 -0.546079 0.591859
H  -5.590339 0.177772 -1.022756
H  -4.826695 2.300615 0.004287
H  -0.549788 2.719893 0.69381
H  -2.836933 3.74717 0.504007
H  0.006286 -0.934029 0.262995
H  2.128661 -1.268354 0.679422
H  3.644552 1.295294 0.823546
H  4.103553 -0.079433 1.868881
H  5.949631 -1.357044 1.141398
