program: Gaussian 09
title: 000027007
version: EM64L-G09RevD.01
frameworkgroup: C1[X(C16H18N2O2)]
method: RPBEPBE
basis: SDD
operation: Freq
keyword: #p
keyword: freq=noraman
keyword: PBEPBE/SDD
title: #p freq=noraman PBEPBE/SDD
converged: YES YES NO NO
title: Mulliken charges:
elementType: O O N N C C C C C C C C C C C C C C C C H H H H H H H H H H H H H H H H H H
charge: -0.272867 -0.281365 -0.194510 -0.093155 -0.231840 -0.443685 -0.434843 0.246596 -0.552218 0.280634 -0.365829 -0.387215 0.220491 -0.213978 -0.253957 -0.239969 -0.384638 0.201995 -0.220252 -0.673411 0.289670 0.241416 0.214785 0.229494 0.219140 0.227490 0.228332 0.247166 0.235775 0.292196 0.231729 0.229463 0.277661 0.227640 0.227919 0.211311 0.231587 0.231243
chargesum: 0.00000
title: Mulliken charges with hydrogens summed into heavy atoms:
elementType: O O N N C C C C C C C C C C C C C C C C
charge: -0.272867 -0.281365 -0.194510 -0.093155 0.057830 0.012516 0.013791 0.246596 -0.096396 0.280634 -0.118662 -0.151440 0.220491 0.078217 -0.022228 -0.010505 -0.106978 0.201995 0.235307 0.000730
polarizability: 2.52221453e+02 -6.45680091e+00 1.62509108e+02 6.89592840e+00 2.77753867e-01 1.49660073e+02
1716.lowfreq: -5.9044 -0.0006 0.0004 0.0007 3.0063 6.8155 24.6751 41.5080 48.9444
frequency: 24.2766 41.4924 48.9400 60.1365 76.7288 95.0726 99.8129 134.8468 157.5360 162.5766 193.4333 246.4064 265.5687 273.7013 284.0913 328.7339 350.3795 370.7881 399.8443 431.2484 454.0897 483.0688 507.8711 537.0679 583.2838 621.9504 629.0872 648.8565 693.1720 720.9776 732.9277 745.9772 773.9123 791.5092 799.4724 812.7741 817.1265 835.0225 860.1064 863.4104 878.6346 888.5668 897.8501 932.0001 960.0666 992.3002 1005.7868 1018.3698 1035.5791 1047.5416 1069.8317 1097.7035 1110.6815 1112.6827 1117.6672 1135.5305 1150.1279 1162.4087 1171.7693 1176.7626 1196.0349 1206.3922 1214.8914 1235.2801 1248.2436 1254.7927 1272.9256 1284.1433 1316.6264 1324.8799 1338.4317 1347.0756 1360.9087 1363.2560 1378.7245 1383.7290 1401.0300 1421.5734 1440.5112 1451.6614 1462.6384 1464.1913 1473.2542 1475.3477 1477.9616 1488.7735 1489.8991 1590.0032 1612.6964 1615.4815 2959.2731 2989.7942 2996.4054 2999.5819 3009.0244 3024.3836 3047.6519 3052.6856 3067.3479 3072.5939 3093.0407 3107.9770 3114.5190 3119.7273 3140.0371 3162.0765 3242.2652 3251.1886
redmass: 4.0290 3.3467 3.9005 4.2193 5.4985 4.6380 2.4717 3.3057 4.7098 3.4531 3.1154 1.4016 3.3480 3.6672 3.6872 3.0776 3.5338 3.5929 5.6882 2.6469 4.0066 3.9145 4.9336 4.2356 2.7596 5.2037 4.7236 3.4733 3.3072 5.5966 3.9175 1.6404 4.1412 2.8914 1.1013 1.4469 2.7390 3.5479 1.4850 1.7119 1.9392 1.7362 4.0525 2.9405 1.4069 1.3305 2.3392 2.3427 2.5182 4.3078 2.3284 1.8374 1.9562 2.1975 1.8288 1.4577 1.4284 1.3433 3.9389 1.0719 1.5400 1.9181 2.0555 1.4745 1.1364 1.9951 1.4007 3.7644 1.7925 2.7146 1.5577 1.3812 1.7800 1.6919 2.2046 3.9767 1.2703 2.7605 2.2710 1.1435 1.0403 1.1085 1.2643 1.0927 2.1473 2.2322 1.2810 6.8313 8.0673 7.8530 1.0649 1.0643 1.0359 1.0644 1.0580 1.0936 1.0866 1.0988 1.1067 1.0990 1.0985 1.1025 1.0870 1.0893 1.0928 1.1004 1.0968 1.1006
irintensity: 0.3515 0.2475 0.1876 0.2667 1.8882 1.0263 2.2518 0.3695 1.5717 1.9742 2.5798 1.0565 2.8772 9.6458 6.3750 1.4863 5.0935 5.2819 1.3707 6.2375 0.6759 1.0629 2.7715 0.8192 1.5242 2.1542 7.6520 18.5724 3.5323 11.3697 4.2000 53.0333 21.5806 6.1217 2.9143 17.9562 7.1436 0.5505 13.7354 3.0172 4.4165 17.2707 16.5496 14.2369 1.8346 0.0896 5.1622 7.0273 3.0969 335.9820 93.2961 12.6208 21.2779 6.2079 28.9653 5.1977 75.4375 0.7633 214.0976 2.1406 13.5780 30.7511 14.3780 1.0434 0.0065 7.6481 11.7426 22.5175 57.4563 110.3223 0.7071 1.9319 0.4618 17.2650 13.3544 7.5103 20.4912 28.6427 6.3344 14.6051 11.9074 11.1856 29.3972 11.7899 26.5688 15.6489 20.1347 2.7799 153.2058 119.3503 25.8882 21.9003 23.1987 18.1775 21.9104 30.5129 11.2871 42.6796 9.1706 36.6635 30.2499 42.4281 12.4856 2.3310 24.4362 29.8385 0.7810 1.1481
temp: 298.150 k
press: 1.00000 atm
elementType: 8 8 7 7 6 6 6 6 6 6 6 6 6 6 6 6 6 6 6 6 1 1 1 1 1 1 1 1 1 1 1 1 1 1 1 1 1 1
symmnumber: 1
zpe: 813221.8 jmol-1
zpe.correction: 0.309740 hartree
zpe.thermalcorrener: 0.327675 hartree
zpe.thermalcorrenthalpy: 0.328619 hartree
zpe.thermalcorrgfe: 0.262279 hartree
zpe.sumelectzpe: -879.009505 hartree
zpe.sumelectthermal: -878.991569 hartree
zpe.sumelectthermalent: -878.990625 hartree
zpe.sumelectthermalfe: -879.056965 hartree
dipole: 0.6131 1.8311 -1.7600
dipole: 2.6127
quadrupole: -91.9230 -115.6687 -128.5973
quadrupole: -0.1686 4.5344 10.1228
quadrupole: 20.1400 -3.6057 -16.5343 -0.1686 4.5344 10.1228
hfenergy: -879.3192444 hartree
pointgroup: C01 [X(C16H18N2O2)]
dipole: 0.2613293 0.7594003 -0.641596 debye
polarizability: 251.798637|-8.161176|162.6346755|7.9720858|0.8786806|149.9573224 unknown
InChI: InChI=1S/C16H18N2O2/c1-2-20-16(19)15-10-17-11-18(15)14-9-5-7-12-6-3-4-8-13(12)14/h3-4,6,8,10-11,14H,2,5,7,9H2,1H3
charge 0 multiplicity 1
38 atoms
O  -3.924727 -0.096891 -0.171429
O  -2.256272 0.878825 -1.486989
N  -0.283383 -0.316894 0.467454
N  -0.819866 -1.616652 2.262133
C  0.538214 0.508798 -0.485104
C  0.523726 1.996615 -0.056381
C  1.456083 2.242693 1.145487
C  1.955092 -0.058091 -0.586201
C  2.915279 1.924772 0.755422
C  3.065949 0.599455 0.011914
C  2.156964 -1.267004 -1.300623
C  4.353919 0.01751 -0.122034
C  -1.694084 -0.416704 0.500261
C  0.184868 -1.048024 1.544265
C  3.440165 -1.834125 -1.427976
C  4.547806 -1.185565 -0.830629
C  -1.986695 -1.226643 1.616704
C  -2.590829 0.18836 -0.481637
C  -4.941862 0.462452 -1.112384
C  -6.307263 0.051706 -0.57106
H  0.02742 0.426571 -1.459512
H  -0.513991 2.302171 0.161397
H  0.861634 2.601989 -0.920319
H  1.139077 1.610089 1.997784
H  1.37687 3.292886 1.481347
H  3.566202 1.924843 1.650645
H  3.294729 2.736965 0.100116
H  1.292845 -1.765028 -1.757836
H  5.213433 0.519753 0.339702
H  1.243613 -1.162339 1.758246
H  3.578178 -2.767449 -1.984252
H  5.551601 -1.616207 -0.917868
H  -2.969821 -1.536598 1.96117
H  -4.814009 1.559383 -1.153939
H  -4.745121 0.055283 -2.120778
H  -7.103566 0.440664 -1.23157
H  -6.399261 -1.046834 -0.525145
H  -6.467516 0.456961 0.442619
