program: Gaussian 09
title: 000299632
version: EM64L-G09RevD.01
frameworkgroup: C1[X(C8H11N3)]
method: RPBEPBE
basis: SDD
operation: Freq
keyword: #pfreq=noraman
keyword: PBEPBE/SDD
title: #p freq=noraman PBEPBE/SDD
converged: YES YES NO NO
title: Mulliken charges:
elementType: N N N C C C C C C C C H H H H H H H H H H H
charge: -0.070343 0.000760 -0.062162 0.130363 -0.644921 -0.594343 -0.345370 -0.299669 -0.188924 -0.185704 -0.365328 0.243263 0.250543 0.231590 0.220860 0.259572 0.223365 0.240938 0.264287 0.231779 0.225782 0.233664
chargesum: 0.00000
title: Mulliken charges with hydrogens summed into heavy atoms:
elementType: N N N C C C C C C C C
charge: -0.070343 0.000760 -0.062162 0.130363 0.080474 0.109454 -0.104432 -0.035382 0.042854 0.040078 -0.131664
polarizability: 2.16270990e+02 -1.31076334e+00 1.03498452e+02 1.12965449e-01 -3.80363721e-01 5.35838319e+01
1716.lowfreq: -9.1988 -6.7133 0.0008 0.0010 0.0011 6.0218 51.0195 68.7804 96.0251
frequency: 50.9389 68.7595 96.0229 100.9627 173.3740 191.9658 247.5474 290.9385 325.6737 350.5756 409.4533 446.6825 519.5404 531.9784 614.3001 646.3475 745.1345 784.4962 815.7764 875.8563 889.5075 899.4594 955.0774 955.6489 1000.8880 1031.7415 1033.5128 1047.5815 1085.3759 1087.5843 1123.0371 1157.0881 1240.0175 1265.7056 1270.9546 1290.3540 1323.8986 1371.9207 1411.2948 1417.2603 1431.8837 1455.5307 1459.6220 1469.5692 1483.8610 1493.5238 1551.3773 1558.9683 1581.9188 2939.5186 2949.5589 3017.6807 3035.1754 3073.9904 3107.8510 3120.5217 3123.6533 3134.1466 3160.3518 3171.9713
redmass: 2.5804 2.3796 2.4402 3.5740 1.1980 1.6896 3.7756 2.9876 3.4460 3.5028 3.6110 3.0154 2.8514 4.5114 6.8926 5.5743 1.8442 1.9529 4.8955 3.8480 1.4284 1.4080 1.4554 6.3544 1.3283 1.8684 1.8549 2.1199 1.5970 1.2745 1.3376 1.0793 1.7801 3.6482 2.5255 1.6458 5.3085 2.3358 1.8950 1.1467 1.2720 1.8907 1.0858 1.0836 1.0627 1.1834 5.4885 5.6261 5.9243 1.0401 1.0434 1.0965 1.0935 1.0875 1.0970 1.0881 1.0971 1.0893 1.0950 1.0997
irintensity: 2.0073 9.8165 0.7491 6.4496 5.5765 0.6301 0.6570 2.8065 2.8542 7.0062 5.4967 1.4956 13.8659 10.9446 4.0736 8.7435 35.3071 29.1735 5.1115 6.7100 36.9337 11.4560 2.7012 17.4020 0.8259 37.7597 1.6500 112.9007 14.7869 2.8656 20.9598 7.0051 4.7971 13.1855 19.7197 14.2880 4.4816 120.6907 20.9341 20.5000 0.9009 33.2833 26.4056 22.2941 18.3042 26.2718 33.3990 327.1454 41.9575 45.4847 157.6037 33.5758 47.2820 34.2111 12.2282 23.9789 12.0106 15.9966 27.4289 16.1900
temp: 298.150 k
press: 1.00000 atm
elementType: 7 7 7 6 6 6 6 6 6 6 6 1 1 1 1 1 1 1 1 1 1 1
symmnumber: 1
zpe: 469324.4 jmol-1
zpe.correction: 0.178756 hartree
zpe.thermalcorrener: 0.189675 hartree
zpe.thermalcorrenthalpy: 0.190619 hartree
zpe.thermalcorrgfe: 0.141416 hartree
zpe.sumelectzpe: -474.838482 hartree
zpe.sumelectthermal: -474.827564 hartree
zpe.sumelectthermalent: -474.826620 hartree
zpe.sumelectthermalfe: -474.875823 hartree
dipole: -2.9103 0.9572 0.1713
dipole: 3.0685
quadrupole: -44.4220 -63.2557 -69.2757
quadrupole: 4.6256 -0.4821 0.0859
quadrupole: 14.5624 -4.2712 -10.2912 4.6256 -0.4821 0.0859
hfenergy: -475.0172384 hartree
pointgroup: C01 [X(C8H11N3)]
dipole: -1.1227779 -0.0472206 -0.4410603 debye
dipolederiv: -1.6704295 -0.1040002 -0.2726274 -0.4473912 -0.3039329 -0.0692857 0.2082637 0.0371006 -0.1995064 1.6007652 0.1698233 0.2772138 0.2385785 -0.0908837 0.0298661 0.2863265 -0.0001376 -0.3381284 -0.7314049 -0.0271527 0.023701 -0.0695187 -0.2560066 -0.0076868 -0.2595078 -0.0252826 -0.3250002 1.3478665 0.0865603 0.0347077 0.0651615 0.0653928 -0.0032377 -0.2595149 -0.0204899 0.0310982 0.1353755 -0.0111148 -0.0401487 0.0218883 0.2926182 0.0219439 -0.3736512 0.0066387 0.2301144 0.4280083 -0.0134481 0.2626273 0.1350151 0.2851832 -0.0267026 0.5776655 -0.0299849 0.3000859 -0.8183191 -0.0467834 -0.1065372 -0.1005591 -0.224875 0.0385185 -0.7684514 -0.0037128 0.1551329 -0.5281629 -0.0175184 0.0475414 0.0302949 -0.1169411 0.0097325 0.4808157 0.0367964 -0.0775459 0.3819597 0.0316211 -0.0166885 0.0378604 -0.1181607 0.0406864 0.0047579 0.0415827 0.2006537 -0.2014507 0.0021989 0.0213077 -0.0325619 -0.1546336 -0.014974 -0.2257826 -0.0316624 -0.283862 0.3066827 0.0267602 -0.0112124 0.0659167 -0.0719399 0.0522806 0.3026076 0.0733791 0.333091 0.0629259 -0.0776763 -0.0361456 0.0758163 -0.1208088 -0.1015609 0.1396683 -0.042973 -0.0101697 0.0856692 0.086633 -0.091228 0.0183155 -0.0280108 0.0883088 0.0718288 0.0754401 -0.0533394 -0.1581317 -0.0282905 0.0117226 -0.032445 0.1143102 -0.0077415 -0.0193012 -0.0128647 0.1015311 -0.1483798 -0.1301616 -0.0661276 -0.1623318 -0.0355387 0.0127256 -0.0299882 0.0540608 0.0647569 0.0838659 0.0472392 0.1215472 0.0166737 0.112665 -0.0315942 0.0392739 -0.0336191 -0.0219006 -0.1102845 0.0758351 -0.1078382 0.2081748 -0.1360702 0.09035 -0.1941268 -0.0093488 0.0198829 0.0021436 -0.007955 0.0480957 -0.0080358 0.198258 -0.0316771 0.1032786 -0.0268057 -0.0890814 0.0669631 -0.019539 -0.0897349 -0.0165396 0.1522909 -0.0267518 -0.069537 -0.0247681 0.0023333 0.0416352 0.0025912 0.0773442 0.00654 0.1422674 -0.0234613 0.1090867 -0.0215129 -0.0824802 -0.1413473 -0.0212253 0.0116549 -0.0197597 0.1694793 -0.0091327 0.0242023 -0.0080116 0.0947969 -0.0359502 -0.024397 -0.0991749 -0.0310928 0.1253369 -0.0306061 -0.1479142 -0.0338243 -0.052463 unknown
polarizability: 215.1228765|10.6261598|54.9237291|6.8292789|6.0911585|103.3066681 unknown
InChI: InChI=1S/C8H11N3/c1-11(2)10-7-8-5-3-4-6-9-8/h3-7H,1-2H3
charge 0 multiplicity 1
22 atoms
N  -2.885593 -0.346435 -0.126973
N  -1.548975 -0.249435 -0.372121
N  1.54056 0.199847 1.468735
C  0.748108 0.000271 0.356778
C  -3.466997 -0.159624 1.210242
C  -3.754144 -0.35558 -1.308627
C  -0.690232 -0.069332 0.626346
C  1.301667 -0.125743 -0.952506
C  2.696189 -0.042942 -1.115686
C  3.516838 0.162441 0.022843
C  2.889038 0.276072 1.284037
H  -3.248039 0.851694 1.61455
H  -3.065232 -0.906794 1.92238
H  -4.558727 -0.287553 1.146845
H  -4.550123 -1.115524 -1.202285
H  -3.130035 -0.604385 -2.179646
H  -4.231163 0.631499 -1.483841
H  -0.966728 0.035078 1.686765
H  0.625979 -0.28442 -1.797589
H  3.143132 -0.137123 -2.11179
H  4.605899 0.231488 -0.062709
H  3.483378 0.434902 2.192153
