program: Gaussian 09
title: 000299646
version: EM64L-G09RevD.01
frameworkgroup: C1[X(C11H13N5O)]
method: RPBEPBE
basis: SDD
operation: Freq
keyword: #p
keyword: freq=noraman
keyword: PBEPBE/SDD
title: #p freq=noraman PBEPBE/SDD
converged: YES YES NO NO
title: Mulliken charges:
elementType: O N N N N N C C C C C C C C C C C H H H H H H H H H H H H H
charge: -0.178184 -0.424063 -0.171773 -0.021015 -0.016674 -0.002023 0.089041 0.187792 -0.687872 -0.688640 -0.685489 0.194465 -0.041484 0.314473 -0.601219 -0.210560 -0.165902 0.200055 0.226735 0.235091 0.199687 0.235068 0.226959 0.232599 0.203110 0.231731 0.333476 0.252652 0.279351 0.252616
chargesum: 0.00000
title: Mulliken charges with hydrogens summed into heavy atoms:
elementType: O N N N N N C C C C C C C C C C C
charge: -0.178184 -0.090588 -0.171773 -0.021015 -0.016674 -0.002023 0.089041 0.187792 -0.025991 -0.026926 -0.018048 0.194465 -0.041484 0.314473 0.183399 -0.210560 -0.165902
polarizability: 2.26946313e+02 -4.14594984e+00 1.71804723e+02 -4.73315736e-02 8.60324515e-03 9.01851732e+01
1716.lowfreq: -69.5320 -11.0473 -3.7680 -2.0695 -0.0004 0.0002 0.0004 3.8216 39.1039
frequency: -69.5316 -9.8341 39.0551 41.7519 67.0839 94.2099 98.9631 147.4876 156.0868 176.7815 191.5806 211.5508 228.9658 242.8615 262.0002 268.7608 306.2220 336.6959 342.8081 370.5973 373.8123 436.9253 469.9402 471.4436 499.2889 517.8573 551.3760 602.8166 615.1700 649.3926 657.7438 690.5914 719.7711 738.7736 809.9019 893.8855 910.4593 926.5404 935.0099 948.4252 994.6733 1017.5257 1024.4734 1094.6873 1122.6979 1147.1497 1206.1390 1206.9143 1225.1253 1250.4711 1266.0330 1342.5899 1380.1422 1381.3355 1396.3189 1407.4900 1447.4477 1453.9563 1459.9368 1462.3581 1465.8311 1470.5742 1477.1574 1478.3707 1485.4885 1492.0761 1527.5968 1539.5834 1637.6360 2175.9007 2186.8405 2973.3101 2976.0923 2993.6792 3009.9538 3063.9224 3069.0756 3082.8659 3085.2676 3093.6323 3100.4805 3102.9295 3150.4422 3519.9519
redmass: 1.0410 3.0476 8.7478 5.4181 5.9466 4.9984 12.2202 5.6451 4.7847 1.0516 3.9426 3.1510 1.6234 1.1461 3.2622 2.1506 2.8903 4.5241 3.3990 2.6137 5.2170 3.1546 11.8281 9.9952 7.1244 12.0218 3.7590 5.9854 1.4837 3.7484 9.0309 6.2102 7.6798 10.4475 3.2810 4.4866 6.8126 1.7034 1.5961 1.2059 3.6093 1.4165 1.4412 3.3552 1.3082 2.9091 4.8687 2.9751 2.9932 3.2393 4.2278 8.8200 1.1748 1.1997 2.7080 1.2108 1.5645 1.0478 1.1063 1.0499 1.5146 1.0407 1.0507 1.1495 1.1795 1.1727 8.4401 4.0230 6.2050 12.5917 12.6026 1.0358 1.0358 1.0360 1.0347 1.0988 1.0982 1.1009 1.1005 1.0997 1.1028 1.0998 1.1005 1.0763
irintensity: 0.2037 0.4263 8.9019 1.1176 5.3326 0.0126 1.2589 2.8162 0.0038 0.0796 2.8753 10.8028 4.3181 0.5420 1.6088 0.2267 0.9598 0.8902 9.3993 0.1100 2.2706 3.9450 0.0254 0.0511 2.0376 0.1787 3.6193 2.1959 56.0442 24.0081 7.1577 4.0672 2.5502 10.6701 3.1979 8.7370 22.1898 2.8530 4.8055 0.6541 17.9352 0.1313 7.1345 58.1410 0.6918 110.5561 18.4235 7.5730 5.6788 3.1372 19.7509 90.1249 15.5350 18.3162 44.6800 23.1046 18.8578 0.1848 0.7202 1.4267 1.0950 21.9007 12.5452 15.2741 45.6399 31.7174 628.7321 177.4048 121.4348 62.2205 42.8671 22.1892 25.6952 24.6489 22.2403 5.0333 89.6925 10.8406 9.8658 54.4103 10.5257 27.8847 0.4630 22.3096
temp: 298.150 k
press: 1.00000 atm
elementType: 8 7 7 7 7 7 6 6 6 6 6 6 6 6 6 6 6 1 1 1 1 1 1 1 1 1 1 1 1 1
symmnumber: 1
zpe: 600816.7 jmol-1
zpe.correction: 0.228839 hartree
zpe.thermalcorrener: 0.245405 hartree
zpe.thermalcorrenthalpy: 0.246349 hartree
zpe.thermalcorrgfe: 0.184460 hartree
zpe.sumelectzpe: -774.672208 hartree
zpe.sumelectthermal: -774.655642 hartree
zpe.sumelectthermalent: -774.654698 hartree
zpe.sumelectthermalfe: -774.716587 hartree
dipole: 2.2686 -1.9812 0.0106
dipole: 3.0119
quadrupole: -102.5209 -114.6322 -98.3868
quadrupole: 24.3908 0.0239 -0.0229
quadrupole: 2.6591 -9.4523 6.7932 24.3908 0.0239 -0.0229
hfenergy: -774.9010474 hartree
pointgroup: C01 [X(C11H13N5O1)]
dipole: -0.9385768 0.7233089 0.0082379 debye
polarizability: 227.2459758|-0.7427112|171.5039921|-0.2424458|0.2323445|90.1862414 unknown
InChI: InChI=1S/C11H13N5O/c1-11(2,3)10(17)14-9-7(5-12)8(6-13)16(4)15-9/h14H,1-4H3
charge 0 multiplicity 1
30 atoms
O  -2.203434 1.846367 0.003772
N  -1.077052 -0.202451 0.001843
N  2.040863 1.472228 0.000734
N  0.651454 1.538194 0.003849
N  1.207325 -3.279956 -0.013532
N  5.074559 -0.396665 -0.010467
C  -3.566189 -0.236091 0.007673
C  -2.248866 0.591045 0.003875
C  -3.633864 -1.116051 1.291923
C  -3.63058 -1.139468 -1.260311
C  -4.754558 0.754641 -0.003069
C  0.250158 0.225929 0.000302
C  1.379498 -0.671385 -0.004986
C  2.522194 0.17339 -0.004648
C  2.81167 2.721458 0.00306
C  1.32114 -2.087081 -0.009581
C  3.904685 -0.143676 -0.008712
H  -2.840855 -1.886858 1.328027
H  -4.604745 -1.642812 1.323922
H  -3.5505 -0.497033 2.20304
H  -2.840267 -1.913739 -1.27904
H  -3.541702 -0.537838 -2.182494
H  -4.602783 -1.664076 -1.286667
H  -4.726384 1.417261 0.878352
H  -5.706854 0.193934 0.002484
H  -4.726123 1.398723 -0.898211
H  -1.20489 -1.217873 -0.000099
H  3.443951 2.788632 -0.898183
H  2.085221 3.545561 0.008399
H  3.449526 2.781792 0.900843
