program: Gaussian 09
title: 000299638
version: EM64L-G09RevD.01
frameworkgroup: C1[X(C11H16N2O)]
method: RPBEPBE
basis: SDD
operation: Freq
keyword: #p
keyword: freq=noraman
keyword: PBEPBE/SDD
title: #p freq=noraman PBEPBE/SDD
converged: NO YES NO NO
title: Mulliken charges:
elementType: O N N C C C C C C C C C C C H H H H H H H H H H H H H H H H
charge: -0.255128 -0.670594 -0.019439 0.328723 -0.511161 -0.488280 -0.426311 -0.580329 0.153758 0.492488 -0.563756 -0.452481 -0.739489 -0.164732 0.198034 0.237345 0.261055 0.234620 0.190296 0.234582 0.253854 0.221802 0.236267 0.268938 0.245974 0.203888 0.255482 0.216185 0.315225 0.323184
chargesum: 0.00000
title: Mulliken charges with hydrogens summed into heavy atoms:
elementType: O N N C C C C C C C C C C C
charge: -0.255128 -0.032185 -0.019439 0.328723 -0.075781 0.007394 -0.001434 -0.104673 0.153758 0.492488 -0.327489 0.062432 -0.063934 -0.164732
polarizability: 1.42019363e+02 8.61737666e+00 1.45472444e+02 3.42585832e+00 1.07947961e+01 1.10881688e+02
1716.lowfreq: -18.4837 -10.5195 -0.0008 -0.0004 0.0006 8.0587 33.5744 51.3776 84.3082
frequency: 33.5080 50.9761 84.2877 92.6679 106.3211 162.7745 174.0595 198.4764 239.7842 243.9366 261.1899 289.6684 332.8040 343.7744 372.6844 418.0883 430.9265 432.7320 475.2762 506.0587 515.4687 541.6804 577.8883 660.2554 674.8285 714.7741 753.9150 757.8870 794.0271 865.5602 866.4312 919.2416 936.0020 943.7196 983.1594 1011.4970 1027.2472 1046.2999 1055.3711 1066.8060 1114.6425 1122.2826 1151.1934 1203.9550 1208.6304 1218.7597 1257.0939 1277.1638 1285.1021 1291.7019 1320.5005 1327.4744 1339.5667 1344.3779 1357.8152 1387.5901 1417.0804 1449.1505 1452.9358 1455.5114 1474.9078 1480.5123 1483.5677 1489.5952 1555.9142 1625.3891 1651.5903 2195.1130 2966.5214 2972.9906 2983.4285 2987.8781 2994.1034 3002.1935 3014.6505 3038.2004 3045.4971 3049.0844 3068.8406 3071.1949 3091.3878 3123.2388 3537.3232 3677.9448
redmass: 6.1500 3.1408 2.4231 4.6540 2.3992 5.4348 3.2713 2.3299 2.4966 2.1260 2.8275 2.0808 3.6504 2.2960 3.5550 2.5119 1.2846 3.6628 2.7128 2.7178 2.3084 2.8973 2.1722 3.9111 3.4305 3.6265 1.3767 1.4457 1.7089 1.8793 1.8146 1.9081 4.6149 2.2839 1.9757 1.6719 3.4863 1.8065 1.9895 1.6837 2.2391 2.2353 1.6086 1.3972 1.4710 1.5901 1.4325 1.5320 2.0272 1.2798 1.4005 1.5369 1.3759 1.3588 1.6066 1.2048 3.3852 1.0784 1.0875 1.0930 1.0869 1.0825 1.0515 1.0509 7.7468 2.8905 1.5233 12.4189 1.0600 1.0616 1.0385 1.0621 1.0596 1.0595 1.0982 1.0979 1.0990 1.0988 1.1023 1.0983 1.1002 1.0908 1.0455 1.1037
irintensity: 5.7425 5.4427 1.9217 2.5268 1.0641 0.2447 1.8552 1.3434 2.7525 0.8142 0.6932 2.7926 2.9360 1.9997 0.8841 5.6661 79.0492 6.8402 33.4333 68.7842 54.3075 21.9637 17.3531 0.7112 9.9209 3.4028 7.6658 9.4913 7.2700 15.6264 37.9245 1.3068 2.5234 0.2950 13.2511 4.3103 1.7623 6.2807 0.3826 2.1827 2.3163 0.3515 2.7199 3.0038 74.6161 32.4210 59.8174 15.2861 8.1834 1.1914 1.0846 13.5269 4.7511 6.0649 11.9505 19.6198 69.3954 6.3999 7.8156 17.7912 11.2454 25.7170 11.5198 13.4768 173.6403 174.8578 354.0414 20.7694 28.4567 42.9423 26.0470 42.5865 12.2189 19.8056 30.2013 7.2261 0.8641 40.4422 9.7523 60.7386 28.1054 15.3985 83.3876 25.1294
temp: 298.150 k
press: 1.00000 atm
elementType: 8 7 7 6 6 6 6 6 6 6 6 6 6 6 1 1 1 1 1 1 1 1 1 1 1 1 1 1 1 1
symmnumber: 1
zpe: 661090.2 jmol-1
zpe.correction: 0.251796 hartree
zpe.thermalcorrener: 0.266598 hartree
zpe.thermalcorrenthalpy: 0.267542 hartree
zpe.thermalcorrgfe: 0.209896 hartree
zpe.sumelectzpe: -612.416138 hartree
zpe.sumelectthermal: -612.401336 hartree
zpe.sumelectthermalent: -612.400392 hartree
zpe.sumelectthermalfe: -612.458038 hartree
dipole: -5.0397 -2.5996 -4.8959
dipole: 7.4917
quadrupole: -94.6225 -82.7476 -88.7510
quadrupole: 25.9877 -3.0329 -1.2754
quadrupole: -5.9155 5.9594 -0.0440 25.9877 -3.0329 -1.2754
hfenergy: -612.6679342 hartree
pointgroup: C01 [X(C11H16N2O1)]
dipole: -1.8952175 1.2087338 1.9064986 debye
polarizability: 140.9060411|-8.3205418|147.2321386|-2.7878294|9.8458162|110.2353157 unknown
InChI: InChI=1S/C11H16N2O/c1-2-11(5-3-7-12)6-4-9(13)8-10(11)14/h8H,2-6,13H2,1H3
charge 0 multiplicity 1
30 atoms
O  -1.183735 -1.500242 -1.836894
N  -2.894739 2.593374 0.030372
N  4.426004 1.468982 -0.630103
C  -0.05072 -0.693619 0.194666
C  -0.53949 0.044315 1.472109
C  1.197317 0.005186 -0.452092
C  0.284109 -2.185329 0.503296
C  -1.036452 1.479546 1.199242
C  -1.153959 -0.622146 -0.911178
C  -2.045838 1.503624 0.064328
C  -2.082488 0.498915 -0.890601
C  2.484782 -0.024125 0.42407
C  -0.89501 -3.047339 1.006199
C  3.563317 0.795199 -0.153702
H  0.26374 0.067906 2.234713
H  -1.372611 -0.533039 1.913427
H  1.409527 -0.499131 -1.41305
H  0.956576 1.056742 -0.697116
H  1.099388 -2.222263 1.254491
H  0.670394 -2.637843 -0.429356
H  -0.18857 2.144982 0.937454
H  -1.491559 1.901845 2.117495
H  -2.815158 0.528688 -1.707563
H  2.853723 -1.060309 0.532685
H  2.275751 0.352988 1.443606
H  -1.289336 -2.701265 1.979508
H  -1.719438 -3.047089 0.272682
H  -0.567798 -4.094714 1.140456
H  -2.873354 3.299112 0.762825
H  -3.565873 2.70845 -0.726967
