program: Gaussian 09
title: 000026999
version: EM64L-G09RevD.01
frameworkgroup: C1[X(C14H22N2O2)]
method: RPBEPBE
basis: SDD
operation: Freq
keyword: #p
keyword: freq=noraman
keyword: PBEPBE/SDD
title: #p freq=noraman PBEPBE/SDD
converged: YES YES NO NO
title: Mulliken charges:
elementType: O O N N C C C C C C C C C C C C C C H H H H H H H H H H H H H H H H H H H H H H
charge: -0.302878 -0.294890 -0.119438 -0.414955 -0.375872 -0.341738 0.201656 -0.469193 0.273907 -0.644447 -0.660061 0.201100 -0.352181 -0.334258 -0.248449 -0.271550 -0.235049 -0.685925 0.224242 0.236250 0.261075 0.203283 0.232227 0.227469 0.367691 0.227323 0.219828 0.221053 0.252241 0.204159 0.218663 0.229146 0.237003 0.214159 0.217746 0.205578 0.205658 0.232712 0.233011 0.203705
chargesum: 0.00000
title: Mulliken charges with hydrogens summed into heavy atoms:
elementType: O O N N C C C C C C C C C C C C C C
charge: -0.302878 -0.294890 -0.119438 -0.047264 0.084619 0.122619 0.201656 -0.009497 0.273907 0.023758 0.015002 0.201100 -0.123035 -0.097255 -0.034290 -0.053804 0.176187 -0.016497
polarizability: 2.32462476e+02 -3.78616696e+00 1.99468118e+02 -4.26950208e-01 4.89157005e+00 1.07441231e+02
1716.lowfreq: -7.5451 -4.1030 -0.0003 0.0004 0.0006 3.7960 27.0545 27.6131 43.7385
frequency: 26.8509 27.3789 43.6798 63.2360 67.4107 75.8967 84.9064 110.9499 125.5658 135.9592 176.4803 189.2273 197.5299 205.2167 222.1734 243.7159 246.1807 297.1225 313.9282 326.6847 342.6898 396.0403 440.4242 453.4215 485.1941 544.7740 557.1761 562.6368 586.5664 592.2164 609.9330 643.5030 722.5151 730.2444 735.3080 770.4679 780.0855 790.0151 814.4650 830.6152 853.9945 886.4649 903.1790 909.2563 942.3340 943.3466 999.6085 1019.6076 1039.7041 1045.0108 1071.4658 1080.5714 1092.7546 1097.9707 1118.2009 1136.5624 1138.3227 1168.7515 1175.6621 1194.5754 1213.5364 1220.1314 1251.7945 1258.4785 1262.9675 1295.9136 1305.6284 1337.7322 1346.7855 1359.4768 1366.1162 1386.6689 1388.9360 1397.1496 1406.2673 1423.3144 1441.5696 1444.9190 1456.7131 1461.4145 1466.3585 1470.7275 1477.9882 1479.2156 1481.7393 1482.6251 1491.5426 1497.8011 1528.8516 1583.2385 1602.7823 1620.2917 2885.9169 2923.7484 2949.2135 2984.5678 2985.2552 2995.8941 3000.7654 3005.1652 3006.6289 3059.2492 3068.4817 3084.6126 3085.4366 3092.4462 3093.1018 3102.3444 3105.0945 3124.4591 3139.5561 3150.3951 3166.7467 3501.3289
redmass: 3.8556 3.5261 3.8095 3.3061 3.3697 2.9479 4.5817 1.9343 3.8539 2.4811 2.7313 3.9101 1.4144 2.1346 2.0486 1.1911 1.5754 4.7432 2.7604 3.3927 3.2570 2.8242 3.5901 3.1028 3.2951 4.1853 4.4834 4.0384 3.0784 6.3914 3.7444 1.1389 3.5289 1.2611 4.0140 2.6748 1.1446 1.4777 1.3806 1.1680 3.9350 1.3748 2.4367 3.1123 2.1608 1.2852 1.8775 2.8223 2.8626 2.0933 2.1086 1.8326 2.7005 1.7534 2.1599 2.0144 1.4514 1.1085 2.1574 3.3956 2.5977 1.1288 1.4811 1.1446 1.5335 1.3572 1.4153 1.4163 1.3795 1.2938 1.3683 1.2159 1.2114 1.4247 2.7673 2.6353 2.3029 2.3350 1.1007 1.0400 1.0450 1.0442 1.0875 1.0559 1.1206 1.0587 1.0963 1.0939 3.7961 6.3370 5.6565 6.9223 1.0627 1.0937 1.0553 1.0359 1.0355 1.0362 1.0640 1.1073 1.0634 1.0985 1.0995 1.0991 1.0989 1.1018 1.0988 1.1021 1.1013 1.0844 1.0885 1.0937 1.0999 1.0762
irintensity: 2.4717 0.5149 1.7358 2.6563 1.1053 0.2640 0.1328 2.9282 0.5710 1.7338 6.6251 0.9937 0.1284 0.6586 0.8079 0.5432 4.5101 0.0116 1.3518 1.9797 24.3205 3.9098 8.0248 2.5725 6.3453 17.4590 2.1599 1.1403 2.0049 4.6392 5.3129 96.0151 0.7673 115.8433 2.7512 11.2612 3.9687 10.9975 0.0851 3.6210 2.7718 3.9167 10.8373 31.1663 11.0403 0.0382 0.3769 1.4916 63.2362 21.0985 13.1729 10.2952 28.2745 15.8920 7.9844 105.4506 6.5747 3.7193 0.4810 183.3107 23.6314 1.9848 49.8710 1.0080 119.2885 10.4025 17.6446 35.5660 9.3089 6.4176 14.9575 9.5352 33.4456 45.9788 49.6762 195.5087 81.7304 2.0215 19.1088 11.6914 2.3769 12.9716 6.4898 7.7718 15.5483 15.4926 18.9833 41.2749 281.4721 42.6579 225.2088 202.5816 128.6889 52.3649 48.5414 26.3233 21.5775 24.6749 35.0663 39.8409 37.8498 3.2470 9.4826 41.2173 37.2357 46.1679 31.2631 31.6297 34.1260 6.6137 18.9817 47.5585 17.2544 150.6982
temp: 298.150 k
press: 1.00000 atm
elementType: 8 8 7 7 6 6 6 6 6 6 6 6 6 6 6 6 6 6 1 1 1 1 1 1 1 1 1 1 1 1 1 1 1 1 1 1 1 1 1 1
symmnumber: 1
zpe: 891844.8 jmol-1
zpe.correction: 0.339686 hartree
zpe.thermalcorrener: 0.359639 hartree
zpe.thermalcorrenthalpy: 0.360584 hartree
zpe.thermalcorrgfe: 0.289494 hartree
zpe.sumelectzpe: -805.248396 hartree
zpe.sumelectthermal: -805.228442 hartree
zpe.sumelectthermalent: -805.227498 hartree
zpe.sumelectthermalfe: -805.298588 hartree
dipole: -3.3340 -1.1556 0.0476
dipole: 3.5289
quadrupole: -81.5300 -106.0648 -112.9981
quadrupole: 13.9337 0.9314 0.7057
quadrupole: 18.6676 -5.8672 -12.8004 13.9337 0.9314 0.7057
hfenergy: -805.5880816 hartree
pointgroup: C01 [X(C14H22N2O2)]
dipole: 1.2768335 -0.545244 -0.0051363 debye
polarizability: 232.8125261|1.5081797|199.2575353|1.670697|-2.9835175|107.3017641 unknown
InChI: InChI=1S/C14H22N2O2/c1-4-16(5-2)14(17)11-15-12-9-7-8-10-13(12)18-6-3/h7-10,15H,4-6,11H2,1-3H3
charge 0 multiplicity 1
40 atoms
O  -2.403703 1.487497 -0.284544
O  1.888087 1.582253 -0.152008
N  3.469905 -0.122444 -0.088136
N  -0.231426 -0.029895 -0.092344
C  3.846613 -1.552338 -0.025915
C  4.568323 0.873713 -0.167501
C  2.166318 0.340846 -0.08117
C  1.03845 -0.709178 0.020353
C  -1.454366 -0.68285 -0.04252
C  4.104411 -2.176289 -1.416379
C  5.046942 1.334728 1.225387
C  -2.651847 0.104701 -0.147039
C  -1.593973 -2.089194 0.104769
C  -3.922775 -0.494733 -0.108666
C  -2.875676 -2.689976 0.143209
C  -4.039372 -1.90296 0.037058
C  -3.563519 2.387087 -0.384915
C  -3.017193 3.807684 -0.506874
H  4.75907 -1.632586 0.59561
H  3.061633 -2.118449 0.503901
H  4.190729 1.740481 -0.735429
H  5.401102 0.420002 -0.736951
H  1.166799 -1.476546 -0.776518
H  1.130243 -1.251485 0.991734
H  -0.199242 0.991542 -0.174378
H  3.195503 -2.140822 -2.042583
H  4.906959 -1.637922 -1.951637
H  4.412723 -3.232865 -1.312625
H  4.221973 1.829628 1.76516
H  5.406558 0.484793 1.834518
H  5.877288 2.057566 1.12456
H  -0.700557 -2.716871 0.190037
H  -4.827179 0.116421 -0.190032
H  -2.955929 -3.777018 0.256751
H  -5.03113 -2.365968 0.066261
H  -4.168774 2.10941 -1.273091
H  -4.196382 2.274404 0.520132
H  -2.384962 3.906141 -1.405761
H  -2.406779 4.066272 0.375151
H  -3.850844 4.529721 -0.581976
