program: Gaussian 09
title: 000299614
version: EM64L-G09RevD.01
frameworkgroup: C1[X(C8H11ClN4S)]
method: RPBEPBE
basis: SDD
operation: Freq
keyword: #p
keyword: freq=noraman
keyword: PBEPBE/SDD
title: #p freq=noraman PBEPBE/SDD
converged: NO YES NO NO
title: Mulliken charges:
elementType: Cl S N N N N C C C C C C C C H H H H H H H H H H H
charge: -0.031557 0.280604 -0.069781 -0.143564 -0.029527 0.090489 -0.108917 -0.630468 -0.589339 0.144291 -0.281548 -0.415200 -0.167678 -0.831345 0.260723 0.229456 0.297659 0.228070 0.237437 0.231637 0.237074 0.275498 0.244479 0.271406 0.270102
chargesum: 0.00000
title: Mulliken charges with hydrogens summed into heavy atoms:
elementType: Cl S N N N N C C C C C C C C
charge: -0.031557 0.280604 -0.069781 -0.143564 -0.029527 0.090489 0.151807 0.124717 0.116808 0.144291 -0.006050 -0.415200 -0.167678 -0.045359
polarizability: 2.51490122e+02 -7.83659233e+00 1.81478738e+02 -1.91719308e-01 -1.36886080e-01 6.79601005e+01
1716.lowfreq: -4.1557 -0.0024 -0.0014 0.0017 1.8363 5.3574 18.1703 61.5650 67.7281
frequency: 17.9001 61.5627 67.7233 68.7168 111.6425 126.9194 134.8886 142.4178 161.2284 174.3395 200.9709 217.9976 240.7176 276.8579 282.3755 363.7776 378.5735 412.6232 427.0374 441.9473 571.3022 585.6484 652.0600 663.1628 666.6833 756.4617 783.7581 859.3538 865.1029 913.5974 935.9309 978.1960 985.4809 993.1156 1053.8210 1078.8918 1095.7478 1106.2121 1145.6223 1210.1048 1238.4193 1258.4504 1268.0754 1315.8543 1342.7763 1357.9265 1413.0887 1418.9708 1436.1939 1437.8829 1453.4049 1460.4287 1469.0723 1486.9972 1488.5137 1508.8969 1514.5986 1619.7587 2968.6875 2975.6382 3019.2555 3044.6339 3054.3077 3054.4323 3100.8664 3121.8437 3143.1501 3147.4854 3215.9496
redmass: 2.7490 4.0596 4.4895 4.2489 1.2212 1.1631 1.1805 5.0491 4.0806 5.0810 5.5135 2.7898 3.9403 6.3549 5.0784 2.6575 4.5720 9.3632 7.0118 3.6727 5.6598 7.6002 8.2029 7.9798 7.2125 4.4300 11.8462 4.0262 1.5764 9.5740 5.2340 1.1797 1.4864 1.3572 1.4066 1.8263 1.2244 1.8002 1.3847 8.8346 3.5012 3.2848 5.4539 2.6578 1.2582 1.8926 1.1911 2.6974 1.0537 1.2727 1.0560 1.0428 1.1543 1.0486 1.9168 2.7076 4.8166 5.2088 1.0351 1.0352 1.0281 1.1017 1.0998 1.0910 1.0988 1.0987 1.1038 1.1056 1.0948
irintensity: 0.7210 0.1723 0.3986 3.6637 0.0377 0.0940 0.4088 0.9546 0.9311 3.3457 1.0839 1.7433 2.7207 7.3727 2.7465 25.6308 1.4669 2.5329 8.1700 1.7736 2.6334 1.1333 0.1278 22.4110 3.4915 0.0200 155.5046 40.4409 32.9871 16.6042 24.4992 9.9988 7.2486 1.0570 11.4439 265.5348 0.9813 57.3079 0.2019 119.1955 5.4336 117.3609 147.5458 20.6460 27.9855 87.5984 48.0460 89.2902 14.4843 122.9831 20.1559 9.3137 96.6362 30.7438 196.4319 632.8634 854.1028 635.7838 63.1503 126.5240 21.4180 34.4684 25.9932 21.3822 20.0860 0.8473 12.5224 14.7263 0.7781
temp: 298.150 k
press: 1.00000 atm
elementType: 17 16 7 7 7 7 6 6 6 6 6 6 6 6 1 1 1 1 1 1 1 1 1 1 1
symmnumber: 1
zpe: 487753.6 jmol-1
zpe.correction: 0.185776 hartree
zpe.thermalcorrener: 0.201408 hartree
zpe.thermalcorrenthalpy: 0.202352 hartree
zpe.thermalcorrgfe: 0.140637 hartree
zpe.sumelectzpe: -1387.514637 hartree
zpe.sumelectthermal: -1387.499005 hartree
zpe.sumelectthermalent: -1387.498060 hartree
zpe.sumelectthermalfe: -1387.559776 hartree
dipole: -9.3618 1.6111 -0.0345
dipole: 9.4995
quadrupole: -84.9068 -90.5777 -98.7364
quadrupole: -1.2068 0.1552 -0.0712
quadrupole: 6.5002 0.8293 -7.3294 -1.2068 0.1552 -0.0712
hfenergy: -1387.7004128 hartree
pointgroup: C01 [X(C8H11Cl1N4S1)]
dipole: -3.5089531 1.1326439 -0.6103265 debye
dipolederiv: -0.4879457 0.4365903 -0.1863379 0.4481719 -0.7043176 0.2566871 -0.189421 0.2556896 -0.1990202 -0.0759158 -0.3299127 0.1265073 -0.2781239 -0.5552154 0.1767099 0.1076248 0.1736272 -0.131159 -1.8638911 0.2770161 -0.179008 -0.0020302 -0.3511302 0.0206555 -0.0589595 0.0266229 -0.3238379 -2.400409 0.1936258 -0.167883 1.0730737 -0.577423 0.1549329 -0.5249797 0.1180363 -0.3839628 -1.4478907 -0.523463 0.1478988 -0.5839701 -0.7126496 0.1913797 0.1744382 0.1962706 -0.2211329 -0.6562208 0.0188986 -0.0285385 -0.3510879 -1.5295074 0.5249482 0.1155083 0.5435944 -0.3392955 2.4037143 -0.3523781 0.2397082 -0.9741378 0.3684238 -0.1725522 0.4861153 -0.1410554 0.1415482 0.1752371 0.1497167 -0.0675196 0.4959509 0.1560383 0.0594895 -0.211994 0.0465814 0.2339307 0.4126278 -0.1946174 0.0920445 -0.5233319 0.2923046 -0.038748 0.2313775 -0.0240503 0.2742476 2.6611687 -0.0318547 0.1241207 -0.1275758 0.666667 -0.208936 0.1496176 -0.2097514 0.2252576 -1.3328169 0.2498874 -0.1496737 0.5742087 -0.4635087 0.1539485 -0.2731334 0.1420923 -0.193832 0.8456421 0.5012116 -0.160071 0.6694329 1.523625 -0.5625491 -0.2258772 -0.5717504 0.2092025 1.6221529 -0.3939442 0.2196483 -0.2792317 1.5396249 -0.592487 0.1685824 -0.5970061 0.2818588 0.0029916 -0.0439679 0.0168921 -0.0625978 0.1273473 -0.0334239 0.0237885 -0.0323895 0.0605408 0.1213628 -0.0274079 0.0120008 -0.0075347 -0.0707285 0.1033465 0.0116816 0.1001333 0.1238076 -0.0725638 -0.013763 0.1153628 -0.0088973 0.0529876 -0.0912827 0.1953801 -0.0325798 -0.0328357 0.1787806 0.1069192 -0.0403772 0.0386153 0.0427063 0.0383076 -0.0144174 0.0401627 0.113273 -0.0607963 -0.093013 -0.0737387 -0.1463283 0.068936 -0.0235757 -0.1298964 -0.07908 -0.0580615 -0.0874144 0.0335377 -0.12313 0.0127031 0.0363121 -0.0842054 -0.2116041 -0.0090766 -0.0605462 0.0345794 -0.1345189 0.0529569 -0.0361047 -0.0236366 0.0607961 0.0116517 0.0569981 0.099179 -0.108767 0.1130402 0.0576888 0.1549203 0.0427297 0.0001695 0.1362132 -0.0753616 -0.0421376 0.0911812 -0.0496636 0.0161217 -0.0533986 0.0440371 0.0505072 0.0185231 0.0503026 0.1605818 0.0623259 -0.072317 0.0241767 -0.0668708 -0.0895268 0.0796717 0.0221517 0.0794264 0.0983571 -0.0155692 0.1260005 0.0636519 0.0436907 0.0770738 -0.0056286 0.0673006 -0.0107012 -0.0283686 -0.0015639 0.0543774 -0.1325019 -0.0095461 0.0388301 -0.0581611 -0.0796718 -0.0467354 -0.0075949 unknown
polarizability: 246.2761596|-15.6496692|170.1147323|13.6436012|-40.7648778|84.538069 unknown
InChI: InChI=1S/C8H11ClN4S/c1-13(2)5-10-7-4-6(9)11-8(12-7)14-3/h4-5H,1-3H3
charge 0 multiplicity 1
25 atoms
Cl 3.244152 -2.863814 1.302848
S  2.868136 2.119199 -0.648392
N  -3.492776 0.213946 -0.189261
N  -1.376932 -0.705567 0.279324
N  0.627672 0.595413 -0.148294
N  2.809531 -0.376466 0.317249
C  -2.127704 0.289156 -0.173488
C  -4.199707 -0.98051 0.303087
C  -4.312348 1.321728 -0.698867
C  0.012156 -0.570391 0.281656
C  0.792223 -1.671046 0.740863
C  1.978596 0.630102 -0.108741
C  2.186232 -1.492098 0.726542
C  1.426567 3.222918 -1.129216
H  -1.702817 1.229157 -0.561986
H  -4.851752 -0.717507 1.157405
H  -3.445677 -1.713935 0.624738
H  -4.824549 -1.415188 -0.499772
H  -4.922438 0.992379 -1.561756
H  -3.665226 2.152872 -1.023698
H  -4.996228 1.694772 0.087311
H  0.310055 -2.587443 1.07875
H  1.881135 4.167863 -1.466175
H  0.778034 3.39117 -0.257759
H  0.851964 2.755589 -1.941569
