program: Gaussian 09
title: 000299603
version: EM64L-G09RevD.01
frameworkgroup: C1[X(C10H11NO)]
method: RPBEPBE
basis: SDD
operation: Freq
keyword: #p
keyword: freq=noraman
keyword: PBEPBE/SDD
title: #p freq=noraman PBEPBE/SDD
converged: YES YES NO NO
title: Mulliken charges:
elementType: O N C C C C C C C C C C H H H H H H H H H H H
charge: -0.267750 -0.110244 -0.619714 0.231533 -0.311369 -0.484712 0.472940 -0.379438 -0.422675 -0.218087 -0.219010 -0.244671 0.248107 0.229135 0.230511 0.227946 0.235676 0.236243 0.257059 0.231038 0.224863 0.225200 0.227420
chargesum: 0.00000
title: Mulliken charges with hydrogens summed into heavy atoms:
elementType: O N C C C C C C C C C C
charge: -0.267750 -0.110244 -0.142472 0.231533 0.147089 -0.012793 0.472940 -0.122380 -0.191637 0.006776 0.006190 -0.017251
polarizability: 1.37987298e+02 5.66028332e+00 1.11328889e+02 1.26678459e+01 3.88979394e-01 7.86026391e+01
1716.lowfreq: -26.6498 -10.9391 -0.7335 -0.0008 0.0003 0.0006 19.1710 27.3845 63.3957
frequency: 14.3613 26.7783 63.3868 106.6138 188.5224 243.2468 289.7377 342.7069 403.5069 463.8798 522.7965 610.3591 623.5516 697.1191 710.9333 713.6637 770.5021 812.1308 817.9400 830.1980 854.5870 880.9558 909.3271 923.0557 940.8408 977.6843 980.4151 990.2922 995.8265 1027.3551 1078.9892 1083.9966 1138.3017 1152.9000 1171.6169 1188.3264 1200.4958 1205.7667 1233.7302 1286.8435 1302.7992 1319.4532 1337.6154 1384.4236 1441.1725 1452.5436 1468.8271 1483.6396 1486.3523 1595.5796 1611.6736 1632.1898 3012.9113 3021.5974 3033.2236 3063.1381 3085.9617 3105.0167 3119.2510 3122.8969 3134.9506 3145.5557 3162.3692
redmass: 3.8862 3.9950 4.2548 2.3236 4.0885 4.5262 4.9751 1.8853 2.8126 3.4246 5.0882 5.6551 5.5287 3.7189 2.6461 2.3511 2.7292 1.6040 2.0690 4.4570 1.2484 3.9931 6.0870 1.5003 3.8717 1.4167 2.5759 6.1031 1.3390 2.2342 1.6213 1.5943 1.9697 1.1166 1.0562 1.1211 2.5605 1.1068 1.4670 1.3235 1.3997 1.4526 1.4392 7.5258 2.0572 1.1430 1.0956 2.1564 1.1044 6.1924 6.1637 8.4511 1.0584 1.0591 1.0586 1.1073 1.1026 1.1111 1.0848 1.0879 1.0921 1.0965 1.1016
irintensity: 0.5476 0.2662 1.0201 0.1805 4.5007 8.3461 4.0777 5.0353 0.0484 5.2079 11.8031 1.7470 2.5155 1.0407 51.1692 57.0883 15.7309 2.5313 0.9252 25.0031 0.2523 37.0364 45.1781 0.9368 6.7350 1.1117 11.5959 0.2908 0.6249 7.9908 1.3163 7.4208 47.9949 2.6753 0.4473 0.7895 1.1445 0.5636 35.2347 5.2726 2.2474 13.7243 14.9334 0.5291 7.7787 20.0564 1.6796 17.7535 7.4435 2.7588 28.3146 90.1032 40.3629 14.0970 57.4993 7.0070 5.2580 38.7327 4.0024 0.2907 14.3733 39.6534 23.4527
temp: 298.150 k
press: 1.00000 atm
elementType: 8 7 6 6 6 6 6 6 6 6 6 6 1 1 1 1 1 1 1 1 1 1 1
symmnumber: 1
zpe: 490447.3 jmol-1
zpe.correction: 0.186802 hartree
zpe.thermalcorrener: 0.197266 hartree
zpe.thermalcorrenthalpy: 0.198211 hartree
zpe.thermalcorrgfe: 0.147686 hartree
zpe.sumelectzpe: -516.746026 hartree
zpe.sumelectthermal: -516.735561 hartree
zpe.sumelectthermalent: -516.734617 hartree
zpe.sumelectthermalfe: -516.785142 hartree
dipole: 0.9446 -0.3046 -1.2263
dipole: 1.5776
quadrupole: -58.8275 -68.5935 -71.3824
quadrupole: -0.0625 -2.4721 -4.3339
quadrupole: 7.4403 -2.3257 -5.1146 -0.0625 -2.4721 -4.3339
hfenergy: -516.9328272 hartree
pointgroup: C01 [X(C10H11N1O1)]
dipole: 0.382435 -0.2963188 -0.3888165 debye
dipolederiv: -0.6391338 0.2380697 0.2505835 0.0450679 -0.8136308 -0.1250012 0.3229467 -0.2854164 -0.4471358 -0.5854585 -0.1528487 0.0263532 -0.1377446 -0.6788135 -0.0218477 0.1018799 0.0255832 -0.3652172 -0.1627478 -0.0274794 0.0635278 -0.0940222 0.1033064 -0.0348685 -0.0221209 -0.0370006 0.0945318 0.7091814 0.0180964 -0.3109371 0.008272 1.0677093 0.2467653 -0.518332 0.2147088 0.2449679 0.3998882 -0.1579488 -0.0364944 -0.0026215 0.0649085 -0.0544075 -0.0455955 0.0739146 0.3660991 0.2509699 0.0568956 0.0452391 0.0412672 0.1217733 -0.0573662 0.0433868 -0.0716877 0.2129277 0.3323227 0.0126948 0.1264278 0.0000148 -0.0280093 0.0200386 0.2962292 0.0301096 -0.0205979 -0.1387518 0.0778687 0.0064896 0.1137356 -0.0249114 -0.0152054 -0.0431612 -0.0334037 -0.139148 -0.1829851 -0.0261463 0.0381276 -0.0008664 0.0341676 -0.1135616 0.003691 -0.091047 -0.0876705 -0.0427762 -0.0089582 0.0605593 -0.0236896 0.0657137 -0.1081131 0.0679243 -0.1109051 -0.0602563 -0.0113792 0.1003117 0.0410927 0.0982793 0.0501405 -0.0306538 0.0223227 -0.036167 -0.1023136 0.0091239 0.0160952 0.115259 0.0079498 -0.0944072 -0.025139 0.1029628 -0.0299068 -0.0918367 0.0173378 -0.0111705 -0.0335856 -0.0049866 0.0011885 -0.1138482 -0.0201491 -0.0461021 0.0173428 0.044273 -0.0099569 0.0073207 0.0332588 -0.0392801 0.1248507 0.0071373 0.0590346 0.0455569 0.0384423 -0.0046845 -0.0492435 -0.0119999 0.0628252 -0.0454336 0.02361 -0.0892197 -0.1349486 -0.1076001 0.1212923 0.0003523 0.1033754 0.0164035 0.018606 -0.0468006 0.0359844 0.0494706 -0.1550155 -0.0918708 -0.0319365 -0.0223248 0.067529 -0.0362874 -0.0778218 -0.0200173 0.053353 0.066823 0.0040558 -0.0264046 0.0155533 0.0198162 0.0837018 0.0730357 0.1221488 -0.0865356 0.0679598 -0.1071917 -0.020878 -0.1068735 0.0134731 0.0217197 -0.0090591 0.0161314 0.1169456 0.089028 0.0530705 -0.0716131 0.0356403 -0.0242411 0.1003653 -0.0512367 0.1081941 0.0601391 0.070569 0.0270397 -0.0539506 0.0441578 -0.0441859 0.1149507 -0.0687114 0.1130082 0.0665517 0.0026736 -0.1157915 -0.0231229 -0.1307814 -0.0407913 0.0261144 -0.0325309 0.0275298 0.130455 -0.0727446 -0.0114433 -0.1231662 -0.0106618 0.0993157 0.0246206 -0.1296072 0.024526 0.0773188 unknown
polarizability: 137.1128481|11.8401103|106.7379031|9.1901058|-12.0140092|84.0680746 unknown
InChI: InChI=1S/C10H11NO/c1-2-4-9(5-3-1)8-10-11-6-7-12-10/h1-5H,6-8H2
charge 0 multiplicity 1
23 atoms
O  2.060705 -1.13606 -0.04476
N  2.223815 1.170833 0.265652
C  0.382265 -0.087569 1.431791
C  1.593411 0.065265 0.550395
C  3.21154 -0.726644 -0.920329
C  3.334557 0.817489 -0.683692
C  -0.925991 -0.085491 0.634579
C  -1.287687 1.05006 -0.134972
C  -1.797579 -1.200535 0.665867
C  -2.501761 1.06938 -0.855713
C  -3.014174 -1.182877 -0.055608
C  -3.370347 -0.04727 -0.817718
H  0.392721 0.753811 2.146276
H  0.476205 -1.02755 2.002281
H  2.947094 -0.995231 -1.956231
H  4.093819 -1.299806 -0.592687
H  4.300448 1.100635 -0.229412
H  3.213935 1.396569 -1.615651
H  -0.610923 1.912555 -0.168292
H  -1.522515 -2.086103 1.251462
H  -2.771996 1.953257 -1.444876
H  -3.679658 -2.053063 -0.02306
H  -4.312984 -0.031953 -1.376405
