program: Gaussian 09
title: 000299593
version: EM64L-G09RevD.01
frameworkgroup: C1[X(C5H10BrN)]
method: RPBEPBE
basis: SDD
operation: Freq
keyword: #p
keyword: freq=noraman
keyword: PBEPBE/SDD
title: #p freq=noraman PBEPBE/SDD
converged: YES YES NO NO
title: Mulliken charges:
elementType: Br N C C C C C H H H H H H H H H H
charge: -0.011639 -0.068415 -0.406763 -0.614994 -0.607938 0.043995 -0.559911 0.240363 0.198161 0.252062 0.185409 0.225853 0.226855 0.188881 0.228891 0.245601 0.233586
chargesum: 0.00000
title: Mulliken charges with hydrogens summed into heavy atoms:
elementType: Br N C C C C C
charge: -0.011639 -0.068415 0.031762 0.048331 0.036690 0.043995 -0.080724
polarizability: 8.37512494e+01 2.23422523e+00 8.98653538e+01 -5.04816261e+00 -1.71901576e+00 5.48799794e+01
1716.lowfreq: -0.0008 -0.0004 -0.0003 7.3023 10.6145 20.7154 53.8849 74.3466 138.5748
frequency: 52.6848 74.2504 138.5601 212.7345 232.1184 261.8901 315.9749 358.8122 394.8246 396.8225 507.3621 558.4097 672.8389 818.4372 912.7855 926.4220 970.2677 1042.4762 1045.4075 1091.6483 1117.3055 1149.9546 1185.5023 1264.2299 1280.8341 1349.6065 1405.6323 1421.3438 1439.6075 1450.6852 1461.3783 1471.4098 1478.0137 1486.5924 1642.8364 2819.3109 2844.9633 2860.3369 3013.6067 3020.6862 3029.8024 3080.5403 3088.9960 3101.6891 3220.3144
redmass: 3.1459 3.5319 3.4461 1.3391 1.0473 2.2202 2.8809 2.0263 3.2512 2.5280 3.4597 3.7119 1.0713 3.8458 1.7961 1.3321 1.8773 1.5764 1.9508 1.2536 1.5209 1.8516 2.0866 2.1218 1.7992 1.3987 1.1633 1.1410 1.1253 1.1171 1.0472 1.0602 1.0557 1.0540 5.8969 1.0696 1.0576 1.0579 1.0856 1.0717 1.0719 1.1012 1.1010 1.0637 1.1133
irintensity: 0.1175 0.5173 0.8914 0.1343 0.4421 3.4442 0.4959 7.8196 2.4501 6.7105 32.3071 10.0435 1.0209 6.5502 5.4838 79.6700 2.1496 26.8620 54.6879 6.5604 27.6751 28.1112 37.1605 28.7716 6.9204 6.2562 15.0308 3.5018 6.1888 4.7449 16.8368 18.4603 13.0193 13.2325 46.9717 71.5420 73.5891 229.1431 19.1751 37.5807 33.6727 27.1023 34.0289 2.3612 6.1626
temp: 298.150 k
press: 1.00000 atm
elementType: 35 7 6 6 6 6 6 1 1 1 1 1 1 1 1 1 1
symmnumber: 1
zpe: 368868.0 jmol-1
zpe.correction: 0.140494 hartree
zpe.thermalcorrener: 0.149484 hartree
zpe.thermalcorrenthalpy: 0.150428 hartree
zpe.thermalcorrgfe: 0.105420 hartree
zpe.sumelectzpe: -264.118262 hartree
zpe.sumelectthermal: -264.109273 hartree
zpe.sumelectthermalent: -264.108329 hartree
zpe.sumelectthermalfe: -264.153337 hartree
dipole: 2.1001 1.7455 -0.5367
dipole: 2.7830
quadrupole: -50.3867 -50.4451 -52.8652
quadrupole: -1.1793 -1.0607 0.2780
quadrupole: 0.8456 0.7873 -1.6329 -1.1793 -1.0607 0.2780
hfenergy: -264.2587566 hartree
pointgroup: C01 [X(C5H10Br1N1)]
dipole: 0.5248895 0.8345764 -0.4762617 debye
dipolederiv: -0.1531545 -0.1673348 0.1137147 -0.1498258 -0.5337537 0.2355734 0.1466054 0.2512697 -0.1894752 -0.6792407 -0.0125044 0.0652906 0.0026603 -0.5044142 -0.0212738 -0.0836631 -0.0371891 -0.4954246 0.5175693 0.0151207 0.201936 -0.0774885 0.1045922 -0.0273381 0.356812 -0.0348221 0.2724688 0.0574309 0.1088792 -0.0026546 0.1761291 0.4574764 0.0458489 0.0431919 0.0680361 0.293242 0.4754266 0.0044788 -0.2057184 -0.0551036 0.2777409 -0.0650376 -0.2681155 -0.0803375 0.2305805 0.1785641 0.1279184 -0.2288689 0.2049959 0.9597167 -0.467115 -0.3405059 -0.4926059 0.1083506 -0.2262819 0.0439178 -0.105012 0.085211 -0.3977042 -0.009596 -0.1060024 0.0040876 -0.3128491 0.0266599 0.0420821 0.0138029 0.0171262 -0.0181406 -0.1240649 -0.0187272 -0.088118 -0.0222004 -0.0972191 -0.084196 0.0267642 0.0520063 -0.1659919 0.2171875 -0.0306169 0.1252831 -0.0532609 -0.0530778 0.0459383 0.1409262 0.0206963 0.0430911 -0.0383483 0.1145555 -0.0203292 0.0458982 0.0346487 -0.0958636 -0.0053482 -0.1237812 -0.2628298 -0.0347374 0.0551176 0.1400624 -0.0322452 -0.0453005 0.0101687 -0.1650568 0.0584944 0.0504898 0.0533473 -0.1255896 0.021905 -0.0149525 -0.0870486 0.053585 -0.0703378 0.0301715 0.0898668 0.0501168 -0.1489584 0.068129 -0.0320967 -0.1143828 -0.0043182 0.1054029 -0.1764538 -0.1219843 0.1720058 0.1883839 0.0814042 -0.0603317 0.0836748 -0.0587895 -0.0265346 -0.0170082 -0.0604764 -0.1281981 0.0472544 -0.1416394 -0.0286275 -0.0144366 -0.0014087 0.0824193 -0.0027597 0.1168671 0.0370241 0.0956743 0.029865 0.1579176 0.0961684 -0.0276738 0.0592745 -0.0450702 -0.0345458 0.1046056 0.0745838 0.1049992 0.1330062 unknown
polarizability: 82.5704886|-1.9033933|86.3620252|-5.1494577|-11.9223374|59.5640688 unknown
InChI: InChI=1S/C5H10BrN/c1-5(6)4-7(2)3/h1,4H2,2-3H3
charge 0 multiplicity 1
17 atoms
Br -1.772819 -1.53498 0.683963
N  1.217907 -0.143326 0.136878
C  0.138702 0.125765 -0.827943
C  1.364261 0.898498 1.168479
C  2.490236 -0.503415 -0.513482
C  -1.24954 0.147022 -0.216967
C  -2.132118 1.170049 -0.270535
H  0.173292 -0.665881 -1.601413
H  0.266179 1.109407 -1.355528
H  0.405478 1.043082 1.695098
H  1.686791 1.888778 0.754799
H  2.115433 0.575351 1.910414
H  3.223259 -0.803096 0.256357
H  2.943288 0.329901 -1.109712
H  2.335833 -1.364249 -1.188398
H  -3.136101 1.107755 0.156077
H  -1.84148 2.107936 -0.759789
