program: Gaussian 09
title: 000299627
version: EM64L-G09RevD.01
frameworkgroup: C1[X(C14H17BrN2O)]
method: RPBEPBE
basis: SDD
operation: Freq
keyword: #p
keyword: freq=noraman
keyword: PBEPBE/SDD
title: #p freq=noraman PBEPBE/SDD
converged: YES YES NO NO
title: Mulliken charges:
elementType: Br O N N C C C C C C C C C C C C C C H H H H H H H H H H H H H H H H H
charge: -0.002323 -0.324900 -0.439444 -0.395162 -0.176670 -0.434233 -0.431554 -0.551778 0.236372 0.268273 -0.384349 -0.386305 -0.251064 -0.243742 0.329508 -0.470050 0.017852 -0.493194 0.275843 0.246830 0.203547 0.203916 0.216686 0.222358 0.228446 0.295557 0.250841 0.233703 0.229008 0.228167 0.281429 0.227832 0.260819 0.237406 0.290372
chargesum: 0.00000
title: Mulliken charges with hydrogens summed into heavy atoms:
elementType: Br O N N C C C C C C C C C C C C C C
charge: -0.002323 -0.324900 -0.143886 -0.113732 0.099173 0.016145 -0.010952 -0.100974 0.236372 0.268273 -0.133508 -0.152602 -0.022056 -0.015575 0.329508 0.018601 0.255258 -0.202822
polarizability: 2.38262511e+02 2.14930016e+01 1.79440350e+02 1.42334621e+01 -1.21398793e+00 1.23028583e+02
1716.lowfreq: -9.2356 -2.3084 -0.0006 -0.0002 0.0002 4.4222 10.1417 12.5524 36.2171
frequency: 8.9755 12.4719 36.0893 53.3327 63.3732 85.4165 107.5462 142.3746 153.6538 175.2171 214.9202 241.1293 248.9316 289.6018 302.0214 318.0328 333.2538 370.6990 408.5731 434.9375 466.6220 487.3975 500.4879 530.6074 562.6089 586.8216 633.1575 656.3400 690.1317 714.9985 725.6505 742.1867 773.7359 784.3477 813.1427 845.4365 876.2814 887.6384 905.4203 924.7079 940.1780 956.3981 969.5378 990.9420 991.8534 1021.9813 1035.2529 1050.8439 1082.7242 1097.1504 1114.1977 1131.5737 1157.9249 1166.6110 1175.3349 1189.0242 1201.3788 1210.7566 1220.5120 1238.7921 1268.4459 1273.1627 1275.7363 1316.5400 1327.7245 1336.7114 1344.4527 1355.3404 1367.3024 1382.3728 1434.0511 1439.5830 1451.1794 1452.1196 1465.2351 1469.3466 1486.5055 1489.6452 1588.7135 1612.5783 1614.7211 1622.2994 2957.1574 2979.9289 2986.5573 3015.8740 3020.6593 3022.2325 3047.7993 3065.7725 3093.2767 3112.0636 3119.6136 3128.4587 3137.4122 3159.4046 3190.7783 3548.0310 3555.4380
redmass: 7.7523 6.0262 5.1312 4.0134 5.5809 2.4234 3.2382 4.0612 4.5444 4.2888 4.4373 2.8392 2.9681 1.6435 2.4439 2.6522 3.1579 3.2478 3.5390 2.6797 3.0655 1.4702 3.1020 4.0156 3.0925 4.1920 2.9209 3.4276 5.1068 8.1578 3.7474 1.9934 1.7514 2.0099 2.8767 1.8241 1.7589 1.6483 2.4980 2.6057 1.1676 1.5741 2.0077 1.3240 3.2084 2.6033 2.4811 2.8260 2.4413 1.9585 1.8120 1.7508 1.3881 1.6295 1.0831 1.3125 1.9753 2.1464 1.4704 1.4479 1.2286 1.2880 1.1932 1.6425 1.3299 1.5775 1.4255 1.2108 1.5442 5.0015 1.3718 2.2775 1.2125 1.1603 1.0964 1.1058 2.3266 2.1984 6.8177 6.0820 5.4330 6.4288 1.0648 1.0653 1.0639 1.0837 1.0625 1.0941 1.0999 1.0985 1.1005 1.0869 1.0885 1.0936 1.0932 1.1005 1.0964 1.0781 1.0775
irintensity: 0.0872 0.1812 0.0138 1.3489 15.9966 3.6558 1.2297 2.1112 0.0728 0.5463 6.5760 3.0730 3.6130 12.6246 8.9975 11.4055 4.1410 1.8637 6.3381 7.7021 20.3500 143.2260 69.0765 5.1598 3.2395 0.4425 6.4402 44.0380 11.6835 8.5503 1.9620 30.8199 50.5411 10.0881 3.4292 3.9759 4.8517 9.2796 9.7982 1.3846 90.0655 14.8589 15.0593 0.0741 8.0818 5.4392 6.3703 12.2103 21.7581 7.8486 5.2222 21.7817 2.6282 4.3291 0.9053 38.9299 10.9664 1.9924 114.9068 38.3640 94.1613 12.4170 4.4713 20.6639 6.4954 4.3679 1.7739 3.4687 0.7585 0.6725 77.4256 4.9295 34.9187 27.2008 16.2210 20.9831 122.5842 616.7483 4.1765 35.4952 102.2645 91.6863 25.8461 22.8428 27.1821 18.3903 48.0935 32.7903 53.8111 35.4832 1.9910 11.6471 2.7345 10.4557 28.1833 33.1929 3.5026 12.8026 17.5526
temp: 298.150 k
press: 1.00000 atm
elementType: 35 8 7 7 6 6 6 6 6 6 6 6 6 6 6 6 6 6 1 1 1 1 1 1 1 1 1 1 1 1 1 1 1 1 1
symmnumber: 1
zpe: 745066.9 jmol-1
zpe.correction: 0.283781 hartree
zpe.thermalcorrener: 0.301585 hartree
zpe.thermalcorrenthalpy: 0.302530 hartree
zpe.thermalcorrgfe: 0.233297 hartree
zpe.sumelectzpe: -740.551069 hartree
zpe.sumelectthermal: -740.533265 hartree
zpe.sumelectthermalent: -740.532321 hartree
zpe.sumelectthermalfe: -740.601553 hartree
dipole: -3.1295 -0.9670 -3.7422
dipole: 4.9733
quadrupole: -120.6389 -107.5841 -114.7456
quadrupole: -5.8598 -0.7528 4.6171
quadrupole: -6.3161 6.7388 -0.4228 -5.8598 -0.7528 4.6171
hfenergy: -740.8348502 hartree
pointgroup: C01 [X(C14H17Br1N2O1)]
dipole: 1.177846 0.511295 -1.4763706 debye
polarizability: 231.9031317|28.0643554|185.877639|-14.3061631|-1.5729682|122.9506741 unknown
InChI: InChI=1S/C14H17BrN2O/c15-9-4-10-16-14(18)17-13-8-3-6-11-5-1-2-7-12(11)13/h1-2,4-5,7,9,13,16-17H,3,6,8,10H2
charge 0 multiplicity 1
35 atoms
Br -6.128304 -1.900231 -0.045505
O  -1.931344 0.617443 1.350943
N  -0.214521 0.41455 -0.223463
N  -2.28338 1.372197 -0.836696
C  0.731078 -0.197687 0.746496
C  0.514289 -1.726174 0.870786
C  1.104571 -2.471293 -0.342625
C  2.633539 -2.264369 -0.39302
C  2.159514 0.163498 0.327741
C  3.043617 -0.803113 -0.228668
C  2.598943 1.503663 0.48657
C  4.347949 -0.393564 -0.6125
C  3.897296 1.897718 0.105445
C  4.778673 0.93892 -0.45029
C  -1.498103 0.782375 0.164296
C  -3.695535 1.684469 -0.552471
C  -4.630665 0.498617 -0.794617
C  -4.979229 -0.330453 0.212904
H  0.498527 0.264782 1.724188
H  -0.567134 -1.917829 0.982522
H  1.008396 -2.081785 1.797761
H  0.634726 -2.089691 -1.271597
H  0.872074 -3.550738 -0.28552
H  3.053623 -2.664479 -1.335928
H  3.097606 -2.854789 0.42517
H  0.131732 0.61698 -1.162052
H  1.907625 2.238098 0.918377
H  5.031306 -1.13585 -1.044548
H  4.222324 2.935014 0.241907
H  5.790758 1.230199 -0.753294
H  -1.966723 1.372746 -1.807164
H  -4.000318 2.54036 -1.181071
H  -3.747261 1.993641 0.503949
H  -4.984184 0.318026 -1.817846
H  -4.636365 -0.232852 1.246419
