program: Gaussian 09
title: 000299601
version: EM64L-G09RevD.01
frameworkgroup: C1[X(C10H11ClO4S2)]
method: RPBEPBE
basis: SDD
operation: Freq
keyword: #p
keyword: freq=noraman
keyword: PBEPBE/SDD
title: #p freq=noraman PBEPBE/SDD
converged: YES YES NO NO
title: Mulliken charges:
elementType: Cl S S O O O O C C C C C C C C C C H H H H H H H H H H H
charge: -0.022711 0.946213 0.932606 -0.555617 -0.537870 -0.553878 -0.555822 -0.457547 -0.033473 0.530226 -0.728415 -0.727111 -0.313137 -0.390651 -0.237443 -0.245995 -0.212579 0.299481 0.332315 0.270186 0.288458 0.287039 0.331936 0.269335 0.331348 0.264248 0.245171 0.243687
chargesum: 0.00000
title: Mulliken charges with hydrogens summed into heavy atoms:
elementType: Cl S S O O O O C C C C C C C C C C
charge: -0.022711 0.946213 0.932606 -0.555617 -0.537870 -0.553878 -0.555822 -0.457547 0.266008 0.530226 0.162544 0.161199 -0.313137 -0.059304 0.026805 -0.000824 0.031108
polarizability: 2.70480169e+02 1.30911984e+01 2.03274948e+02 -2.57276944e-01 -8.92036838e-01 1.13437624e+02
1716.lowfreq: -3.9981 -0.0019 -0.0018 0.0004 1.6120 7.8132 21.6927 36.7413 74.3061
frequency: 21.6309 36.7281 74.3049 86.4420 99.2606 138.9175 149.8528 156.1497 162.0598 172.9008 174.2186 183.4749 190.9900 196.1706 214.3966 255.7360 264.5003 286.0507 313.6980 337.6792 343.8344 359.1039 390.1906 396.5454 437.4821 476.9252 522.5151 528.2716 546.5583 590.1301 593.2465 654.5496 717.9002 733.1794 774.2377 789.9054 792.1880 831.4471 887.1789 889.1612 892.6452 971.2626 980.5733 996.0148 998.9680 1014.3134 1016.8427 1029.0405 1045.5884 1046.7538 1132.7227 1179.3543 1212.2874 1294.9904 1306.1884 1314.6202 1330.0416 1386.0912 1406.8791 1408.5037 1426.8734 1429.0532 1430.6200 1463.2348 1563.0435 1599.8002 1604.3987 2947.6934 2997.2704 3014.7601 3106.8647 3145.4406 3149.8761 3164.5999 3168.4219 3179.2754 3179.3367 3181.2841
redmass: 8.6861 5.6673 5.4740 7.6953 5.7732 3.5826 6.3051 1.5963 3.0428 4.9540 5.1682 2.8857 2.5476 2.1034 9.1304 4.6444 3.8756 7.2078 6.5214 5.5507 7.3904 9.9462 11.4179 8.7082 5.0994 3.9390 5.5268 4.1636 6.4139 8.8154 9.2118 7.0464 7.1592 4.1025 1.2301 14.9133 13.4327 5.2785 2.1149 2.0360 4.5571 1.3451 1.3827 1.3096 1.3095 1.4878 4.3247 1.4683 1.6754 2.0523 1.8449 1.1297 2.2618 1.5709 1.1315 1.1428 1.5907 2.9432 1.0496 1.0458 1.0555 2.2383 1.0539 2.1418 5.3138 6.0771 7.2894 1.0823 1.0268 1.0243 1.0953 1.0879 1.1067 1.0944 1.1088 1.1075 1.0990 1.1076
irintensity: 0.2336 1.2604 7.3582 1.9542 1.9530 8.6456 0.1384 2.9483 1.8542 0.7831 2.2499 4.1519 0.2268 3.4565 1.2010 1.9809 1.0530 23.4495 13.9359 9.9697 2.8434 70.3132 12.2867 60.3546 6.4540 21.6335 14.1335 14.3196 2.2846 25.7441 65.8280 12.2758 38.7327 6.8640 72.4532 8.9815 105.5934 11.9987 42.2741 24.8099 33.7047 5.7757 21.7430 41.9174 64.7472 14.2701 30.6616 57.1953 27.8840 2.0661 3.6337 7.0519 3.1373 0.6017 7.3249 14.1259 47.8585 29.4876 13.4420 9.5450 7.9531 33.9169 25.9626 34.4759 4.6769 76.3650 80.1698 23.9348 12.8774 7.1361 71.7973 0.2804 10.0809 13.7262 8.4700 0.7275 13.4366 0.3073
temp: 298.150 k
press: 1.00000 atm
elementType: 17 16 16 8 8 8 8 6 6 6 6 6 6 6 6 6 6 1 1 1 1 1 1 1 1 1 1 1
symmnumber: 1
zpe: 499352.6 jmol-1
zpe.correction: 0.190193 hartree
zpe.thermalcorrener: 0.209365 hartree
zpe.thermalcorrenthalpy: 0.210309 hartree
zpe.thermalcorrgfe: 0.142135 hartree
zpe.sumelectzpe: -1943.109190 hartree
zpe.sumelectthermal: -1943.090018 hartree
zpe.sumelectthermalent: -1943.089074 hartree
zpe.sumelectthermalfe: -1943.157248 hartree
dipole: -3.3356 -1.6178 -0.3255
dipole: 3.7215
quadrupole: -109.6812 -135.4392 -120.4121
quadrupole: 6.6558 -1.8692 -14.0005
quadrupole: 12.1630 -13.5951 1.4321 6.6558 -1.8692 -14.0005
hfenergy: -1943.2993833 hartree
pointgroup: C01 [X(C10H11Cl1O4S2)]
dipole: 1.4398371 0.2530921 -0.0808138 debye
polarizability: 272.0331457|-5.9029121|201.1135481|7.7945825|-4.8172344|114.0460472 unknown
InChI: InChI=1S/C10H11ClO4S2/c1-16(12,13)10(17(2,14)15)7-8-5-3-4-6-9(8)11/h3-7H,1-2H3
charge 0 multiplicity 1
28 atoms
Cl 1.91444 -3.241893 0.775403
S  -2.577737 -1.045577 0.110511
S  -1.299451 1.893464 0.013546
O  -3.568689 -0.352094 1.210792
O  -2.072709 -2.589455 0.302555
O  0.045926 2.793517 -0.221422
O  -2.539728 2.031063 -1.045041
C  -0.910356 0.018407 0.065967
C  0.220836 -0.729259 0.135214
C  1.665517 -0.475657 0.164238
C  -3.372511 -0.883031 -1.614807
C  -1.955777 2.259489 1.767127
C  2.554934 -1.56578 0.429686
C  2.264874 0.795557 -0.093716
C  3.951216 -1.412142 0.452174
C  3.662363 0.95905 -0.077876
C  4.509334 -0.13979 0.195274
H  -0.038476 -1.809712 0.191359
H  -3.443933 0.199199 -1.796391
H  -2.694873 -1.398782 -2.3088
H  -4.344986 -1.386813 -1.520682
H  -2.323198 3.2944 1.713851
H  -2.748567 1.512858 1.936522
H  -1.097907 2.150312 2.445028
H  1.616719 1.651992 -0.311427
H  4.590473 -2.272835 0.665883
H  4.090552 1.945324 -0.282746
H  5.597313 -0.016212 0.206579
