program: Gaussian 09
title: 000299577
version: EM64L-G09RevD.01
frameworkgroup: C1[X(C6H12N4O2S)]
method: RPBEPBE
basis: SDD
operation: Freq
keyword: #p
keyword: freq=noraman
keyword: PBEPBE/SDD
title: #p freq=noraman PBEPBE/SDD
converged: NO NO NO NO
title: Mulliken charges:
elementType: S O O N N N N C C C C C C H H H H H H H H H H H H
charge: 1.065478 -0.510623 -0.510623 -0.185686 -0.185686 0.002204 0.002204 -0.508708 -0.508686 -0.508686 -0.508707 -0.428802 -0.428802 0.318302 0.251394 0.251391 0.318296 0.251392 0.318296 0.318302 0.251393 0.234094 0.234085 0.234094 0.234085
chargesum: 0.00000
title: Mulliken charges with hydrogens summed into heavy atoms:
elementType: S O O N N N N C C C C C C
charge: 1.065478 -0.510623 -0.510623 -0.185686 -0.185686 0.002204 0.002204 0.060988 0.061001 0.061001 0.060988 0.039377 0.039377
polarizability: 1.31630984e+02 -3.89474914e-06 1.10338837e+02 -8.45174393e-04 -1.29166034e-03 1.01011827e+02
1716.lowfreq: -17.4572 -0.0014 -0.0013 0.0015 10.7297 16.1343 122.1487 143.5065 187.0182
frequency: 121.8817 143.5065 187.0020 210.7747 231.3120 295.4221 315.9019 339.0558 374.5090 376.7580 391.0549 403.0211 410.2253 436.0080 455.0941 468.4858 542.1991 578.3995 613.7920 644.1216 712.9842 732.5311 788.0969 821.1425 838.0769 857.2294 870.1133 912.1403 930.0521 953.0102 962.0511 998.8446 1003.9382 1005.7328 1040.0447 1088.7911 1143.5758 1156.0188 1203.7050 1220.6931 1251.6014 1303.8754 1309.4844 1320.8577 1325.0898 1334.0402 1344.3971 1349.8877 1352.1850 1366.4647 1376.1518 1417.8924 1422.3861 1430.1778 1435.8779 1463.3011 1473.1267 2987.4377 2998.1086 3013.3693 3014.5861 3015.0989 3018.3110 3040.4823 3065.4902 3082.0015 3083.4146 3083.8853 3085.1778
redmass: 1.8456 8.2534 8.8601 4.4691 10.5990 4.1349 4.2557 9.4552 9.7753 3.8817 3.7185 1.9625 2.4756 6.5289 1.8160 5.5159 2.8133 4.3846 4.9389 8.3944 5.3235 5.2521 1.3232 8.4378 3.1180 6.0086 4.5589 4.6731 5.3884 2.1928 4.5692 3.1097 3.8914 2.2427 2.7286 2.2771 2.0796 1.9677 2.2388 1.0677 1.1352 1.3200 1.1988 1.3484 1.2538 1.3314 1.1870 1.3130 1.2320 1.2799 1.2324 1.0766 1.0708 1.0894 1.0887 1.0881 1.0811 1.0593 1.0608 1.0576 1.0584 1.0591 1.0609 1.1038 1.1061 1.1067 1.1072 1.1081 1.1083
irintensity: 0.0000 2.2520 0.0000 1.6879 4.2557 1.6172 0.4594 0.6604 18.7918 8.6164 0.0000 0.0000 0.0216 21.4632 12.0201 64.7806 26.3192 35.3326 59.0764 33.6517 0.0041 133.8150 10.8541 65.4193 0.0000 14.1803 6.9607 39.0034 79.2991 0.0000 46.5138 0.0000 59.9774 35.0947 58.3526 34.7895 20.4550 0.0000 20.4939 0.0000 5.7308 0.0000 6.0341 0.3734 12.8620 0.5142 0.0000 47.4794 18.2042 3.0330 3.2416 0.0000 46.5334 53.1364 0.2579 16.0846 30.3105 20.1358 88.9076 0.0001 57.3486 24.9206 5.1901 0.0000 33.3578 0.0000 1.3682 5.2465 3.5986
temp: 298.150 k
press: 1.00000 atm
elementType: 16 8 8 7 7 7 7 6 6 6 6 6 6 1 1 1 1 1 1 1 1 1 1 1 1
symmnumber: 1
zpe: 517632.9 jmol-1
zpe.correction: 0.197156 hartree
zpe.thermalcorrener: 0.208336 hartree
zpe.thermalcorrenthalpy: 0.209280 hartree
zpe.thermalcorrgfe: 0.161479 hartree
zpe.sumelectzpe: -1002.093568 hartree
zpe.sumelectthermal: -1002.082387 hartree
zpe.sumelectthermalent: -1002.081443 hartree
zpe.sumelectthermalfe: -1002.129245 hartree
dipole: -7.4119 0.0000 0.0002
dipole: 7.4119
quadrupole: -92.7591 -89.9277 -82.9172
quadrupole: 0.0000 0.0003 0.0014
quadrupole: -4.2244 -1.3930 5.6175 0.0000 0.0003 0.0014
hfenergy: -1002.2907238 hartree
pointgroup: C01 [X(C6H12N4O2S1)]
dipole: 2.9160501 0.0000568 -0.0000817 debye
dipolederiv: 1.7362221 0.0000141 -0.0000159 0.0000145 1.0150962 -0.0000264 -0.0000158 -0.0000229 1.1572129 -0.6576769 0.076825 0.0000194 0.2458588 -0.5853304 -0.0000291 0.0000524 -0.0000249 -0.4576986 -0.657664 -0.076828 -0.0000085 -0.2458617 -0.5853439 -0.0000158 -0.0000414 -0.0000207 -0.4576985 -0.6207661 0.0000321 -0.1349021 0.0000488 -0.6205855 -0.0000274 -0.2497859 -0.0000326 -0.5108327 -0.620745 -0.0000322 0.134909 -0.0000491 -0.6205858 -0.0000223 0.249792 -0.0000219 -0.5108531 -0.6634879 -0.215433 -0.0000357 -0.1825753 -0.7366896 -0.0000327 -0.0000137 -0.0000374 -0.4825345 -0.663505 0.2154356 0.0000474 0.1825772 -0.736674 -0.0000425 0.0000249 -0.0000497 -0.4825343 0.3387327 0.212555 0.19089 0.4172344 0.4925899 -0.1148579 0.4342714 0.070581 0.3339241 0.338761 -0.2126325 0.190805 -0.4174087 0.4925618 0.1149212 0.4341158 -0.0705026 0.3339552 0.3387007 0.2126227 -0.1908109 0.4174097 0.4925873 0.1148905 -0.4341145 -0.0705323 0.3339897 0.338724 -0.2125571 -0.1908863 -0.417247 0.4925647 -0.1148425 -0.4342742 0.0705748 0.3339594 0.4262565 -0.0318927 -0.0000049 -0.1161367 0.2290692 0.0000216 -0.0000357 0.0000171 0.1434978 0.426251 0.031901 -0.000011 0.1161454 0.2290757 0.0000153 0.0000199 0.000015 0.1434974 0.0073303 0.0854008 -0.0669825 0.029932 0.0095796 0.0078497 -0.0207444 -0.0526637 0.0987335 -0.0228089 -0.0775335 0.146259 -0.060386 0.08388 0.0060187 0.0374394 -0.0039524 -0.0071726 -0.0228183 0.0774671 0.1462863 0.060363 0.0838873 -0.0059721 0.0374622 0.0039946 -0.0071699 0.0073319 -0.0853742 -0.0670179 -0.0299245 0.0095485 -0.0078918 -0.0207607 0.0526236 0.0987438 -0.0228227 -0.077471 -0.1462852 -0.0603676 0.0838818 -0.0059744 -0.0374611 0.0039976 -0.0071592 0.0073321 0.0853772 0.0670236 0.029924 0.0095529 -0.0078908 0.0207637 0.0526195 0.0987387 0.0073395 -0.0854038 0.0669873 -0.0299315 0.0095748 0.0078541 0.0207514 -0.0526578 0.0987284 -0.0228248 0.0775288 -0.1462586 0.0603818 0.0838854 0.0060091 -0.0374384 -0.0039582 -0.0071624 0.0005059 -0.0237263 -0.0600687 -0.0267817 0.0169844 -0.0414469 -0.1688661 -0.0819242 -0.0610389 0.000565 -0.0237216 0.0600392 -0.0268098 0.0169504 0.0414713 0.1688373 0.0819526 -0.0610437 0.0005173 0.0237209 0.0600666 0.0267787 0.0169864 -0.041446 0.1688658 -0.0819187 -0.0610517 0.0005496 0.0237257 -0.0600445 0.0268112 0.0169529 0.0414672 -0.1688441 0.0819443 -0.0610307 unknown
polarizability: 131.6309842|0.0004323|110.338837|-0.0008452|0.0012916|101.0118275 unknown
InChI: InChI=1S/C6H12N4O2S/c11-13(12)9-3-7-1-2-8(5-9)6-10(13)4-7/h1-6H2
charge 0 multiplicity 1
25 atoms
S  -1.800892 -0.000032 0.000073
O  -2.56873 1.422864 0.000362
O  -2.568673 -1.422958 -0.000173
N  -0.508815 0.000268 -1.435753
N  -0.508735 -0.000278 1.435828
N  1.076572 1.402377 0.00025
N  1.076629 -1.402324 -0.000262
C  0.280798 1.293939 -1.22989
C  0.280883 -1.293436 -1.230381
C  0.2809 1.293457 1.230413
C  0.280919 -1.293918 1.229922
C  2.418063 0.793504 0.000062
C  2.418095 -0.793398 -0.000151
H  -0.472135 2.100889 -1.258276
H  0.937091 1.38747 -2.113235
H  0.937207 -1.386567 -2.113745
H  -0.471999 -2.100421 -1.259111
H  0.937269 1.386613 2.11374
H  -0.472013 2.100411 1.259185
H  -0.47198 -2.100898 1.258351
H  0.937265 -1.387421 2.11323
H  2.960802 1.170486 0.886914
H  2.960643 1.170727 -0.886784
H  2.960798 -1.170358 -0.887034
H  2.960741 -1.170598 0.886664
