program: Gaussian 09
title: 000299572
version: EM64L-G09RevD.01
frameworkgroup: C1[X(C9H20NO5P)]
method: RPBEPBE
basis: SDD
operation: Freq
keyword: #p
keyword: freq=noraman
keyword: PBEPBE/SDD
title: #p freq=noraman PBEPBE/SDD
converged: YES YES NO NO
title: Mulliken charges:
elementType: P O O O O O N C C C C C C C C C H H H H H H H H H H H H H H H H H H H H
charge: 1.437211 -0.575943 -0.534718 -0.489735 -0.261624 -0.577877 -0.132842 -0.337030 -0.354030 0.337656 -0.655383 -0.649865 -0.243853 -0.248516 -0.650514 -0.650656 0.247753 0.210962 0.260392 0.213717 0.238546 0.217195 0.215410 0.242931 0.207787 0.220759 0.216617 0.227035 0.229492 0.240192 0.265474 0.230639 0.208652 0.249730 0.232615 0.211821
chargesum: 0.00000
title: Mulliken charges with hydrogens summed into heavy atoms:
elementType: P O O O O O N C C C C C C C C C
charge: 1.437211 -0.575943 -0.534718 -0.489735 -0.261624 -0.577877 -0.132842 0.121685 0.120079 0.337656 0.015769 0.021612 0.199799 0.221168 0.054251 0.043510
polarizability: 1.66833913e+02 -3.00069908e+00 1.52714533e+02 1.46818061e+00 2.36543743e+00 1.24915566e+02
1716.lowfreq: -20.7066 -9.6205 0.0022 0.0022 0.0023 5.0037 17.5205 23.4646 27.0542
frequency: 12.0892 22.6982 26.6851 35.5478 44.4658 54.9967 65.9965 77.2186 100.5557 116.5767 122.3910 133.4079 169.7469 176.1135 203.0511 212.8141 223.3172 235.1251 251.5849 278.5645 311.9013 316.1869 337.8164 354.7606 381.0533 422.6559 439.8010 466.8326 506.9341 577.3609 599.7582 662.9252 686.8989 700.4596 740.0534 779.4897 789.5143 804.5859 805.1490 862.8492 871.0558 911.2748 940.8559 1009.2169 1015.0007 1027.4897 1072.3190 1076.7673 1081.3330 1090.8723 1095.2368 1096.3154 1129.1493 1141.6721 1147.5784 1214.2843 1250.2487 1260.8652 1264.3778 1303.6834 1345.0696 1346.1644 1347.5759 1361.8647 1383.6823 1387.5193 1390.5787 1394.4355 1395.4168 1457.5225 1458.9596 1460.7552 1465.4432 1468.1706 1469.0117 1469.4970 1475.0061 1480.9826 1483.3993 1487.0448 1490.3618 1666.6592 2984.7837 2985.6056 2989.0005 2990.1377 2999.0146 3004.7923 3012.9030 3027.0334 3070.0240 3072.9330 3077.5041 3082.5325 3086.1087 3086.5397 3086.8728 3091.9664 3099.5610 3101.6172 3112.1088 3116.2056
redmass: 3.9045 3.2612 3.2544 3.0082 3.1678 2.7398 2.7792 2.8538 4.2355 3.4901 3.8803 3.7220 3.8387 2.6980 1.4684 1.5576 1.3696 1.2518 1.5102 4.6937 2.8568 3.3104 5.1150 3.8440 3.8892 3.2690 3.7171 4.5600 3.5027 4.6537 6.8008 7.1656 9.4865 9.5042 4.0549 1.1583 1.2899 1.1097 1.1165 3.4005 3.9662 2.9248 2.0972 2.9471 3.0693 3.1617 10.8554 2.0360 1.8933 2.2270 2.1644 1.8236 2.1997 1.5008 1.5409 2.8483 1.6294 1.1288 1.1238 1.3205 1.2223 1.2427 1.2118 1.2933 1.2177 1.2546 1.2829 1.6789 1.3140 1.0434 1.0700 1.0414 1.0495 1.0732 1.0637 1.0613 1.0841 1.0599 1.0703 1.0553 1.0543 9.6143 1.0355 1.0356 1.0372 1.0365 1.0626 1.0639 1.0645 1.0592 1.0995 1.0995 1.1023 1.0995 1.0970 1.0984 1.0982 1.1022 1.1024 1.1027 1.1030 1.1052
irintensity: 0.8317 1.5863 1.3229 0.9955 1.1068 0.1977 0.9480 1.0586 1.0969 3.3570 0.8810 2.4639 0.6270 2.2260 0.6514 0.0904 4.9112 0.5214 2.2055 14.2738 3.9043 16.7574 27.5500 9.1274 25.6127 2.6074 24.4131 29.7323 24.7213 5.9146 44.8030 131.3011 71.0031 106.5655 157.7920 8.6126 23.3079 4.2640 4.3685 112.5373 184.8536 227.2656 5.5209 183.9700 99.4184 16.0575 150.7264 14.7452 4.0589 24.7389 11.6822 26.2674 159.2768 1.0398 10.9596 41.1632 137.6864 0.6800 0.6091 17.3025 14.3883 0.6214 4.6485 9.6984 12.8235 36.9909 16.2666 135.9788 17.2093 14.4795 23.6188 11.3823 4.3502 2.9438 6.4039 5.1630 16.7167 9.6136 18.5136 16.9216 11.0519 352.2232 23.0627 23.0465 22.7277 14.4551 32.6173 32.6727 35.2218 27.9485 7.7741 3.8432 7.9897 29.3218 23.3372 50.6366 26.6128 10.3019 11.7376 58.8460 27.1117 25.4904
temp: 298.150 k
press: 1.00000 atm
elementType: 15 8 8 8 8 8 7 6 6 6 6 6 6 6 6 6 1 1 1 1 1 1 1 1 1 1 1 1 1 1 1 1 1 1 1 1
symmnumber: 1
zpe: 770825.1 jmol-1
zpe.correction: 0.293592 hartree
zpe.thermalcorrener: 0.315070 hartree
zpe.thermalcorrenthalpy: 0.316014 hartree
zpe.thermalcorrgfe: 0.239141 hartree
zpe.sumelectzpe: -1125.736449 hartree
zpe.sumelectthermal: -1125.714971 hartree
zpe.sumelectthermalent: -1125.714027 hartree
zpe.sumelectthermalfe: -1125.790900 hartree
dipole: -2.4873 -2.2687 -6.1296
dipole: 6.9932
quadrupole: -91.6305 -94.6975 -114.3668
quadrupole: 1.9241 -5.7162 -3.4287
quadrupole: 8.6011 5.5341 -14.1352 1.9241 -5.7162 -3.4287
hfenergy: -1126.0300412 hartree
pointgroup: C01 [X(C9H20N1O5P1)]
dipole: -1.1903156 -1.2606765 -2.1362877 debye
polarizability: 166.3328493|-4.0079846|153.118739|-0.1035308|-3.1993337|125.0124243 unknown
InChI: InChI=1S/C9H20NO5P/c1-5-10(6-2)9(11)15-16(12,13-7-3)14-8-4/h5-8H2,1-4H3
charge 0 multiplicity 1
36 atoms
P  1.713497 0.299916 0.31811
O  0.079691 -0.134151 -0.22574
O  2.540472 -0.567315 -0.921277
O  2.072417 1.900473 -0.128899
O  -0.999128 1.502843 1.096186
O  2.019046 -0.068101 1.822192
N  -2.209076 -0.225678 0.056248
C  -2.198994 -1.456772 -0.769526
C  -3.503275 0.266721 0.591332
C  -1.073484 0.469553 0.387481
C  -1.967703 -2.733446 0.066036
C  -4.237309 1.200929 -0.392548
C  2.625013 -2.058331 -0.836771
C  2.087509 2.363251 -1.555863
C  3.71045 -2.512035 0.142906
C  0.680202 2.661675 -2.076682
H  -1.415059 -1.361227 -1.537758
H  -3.174044 -1.511322 -1.289037
H  -3.296833 0.801337 1.533583
H  -4.126049 -0.616292 0.828551
H  -0.983966 -2.693539 0.564804
H  -2.743642 -2.851698 0.843799
H  -1.995128 -3.627456 -0.584001
H  -3.634036 2.104345 -0.586784
H  -4.437628 0.69867 -1.356708
H  -5.206083 1.51849 0.034657
H  1.630456 -2.463588 -0.566286
H  2.858438 -2.349972 -1.874293
H  2.697001 3.279305 -1.486355
H  2.615726 1.613146 -2.170589
H  3.469904 -2.198893 1.172952
H  4.68838 -2.083965 -0.136153
H  3.794513 -3.615247 0.119553
H  0.138838 3.312412 -1.369509
H  0.096881 1.736775 -2.224295
H  0.752605 3.182785 -3.050117
