program: Gaussian 09
title: 000026980
version: EM64L-G09RevD.01
frameworkgroup: C1[X(C5H5Cl3N4S)]
method: RPBEPBE
basis: SDD
operation: Freq
keyword: #p
keyword: freq=noraman
keyword: PBEPBE/SDD
title: #p freq=noraman PBEPBE/SDD
converged: YES YES NO NO
title: Mulliken charges:
elementType: Cl Cl Cl S N N N N C C C C C H H H H H
charge: 0.103460 0.126215 0.103964 0.291702 0.028920 -0.025119 -0.003723 -0.575628 0.309639 -0.756919 -0.336916 0.040045 -0.822679 0.347445 0.349413 0.287237 0.286431 0.246511
chargesum: 0.00000
title: Mulliken charges with hydrogens summed into heavy atoms:
elementType: Cl Cl Cl S N N N N C C C C C
charge: 0.103460 0.126215 0.103964 0.291702 0.028920 -0.025119 -0.003723 0.121230 0.309639 -0.756919 -0.336916 0.040045 -0.002500
polarizability: 1.51269799e+02 1.89249289e+01 1.66000400e+02 -1.71084049e-02 8.48928258e-03 8.20563536e+01
1716.lowfreq: -12.8179 -9.9915 -6.4915 -2.7068 -0.0034 -0.0032 -0.0025 61.7527 90.5205
frequency: -11.7145 61.6962 90.5186 98.9539 104.1432 150.4848 156.6059 180.9910 215.3560 217.6875 225.6378 287.7968 291.2056 311.3016 375.3816 415.5841 498.3342 545.5259 560.2119 570.1953 612.4257 656.0599 668.3341 693.6413 752.4786 754.5670 819.6741 889.7973 899.7343 981.1563 984.7000 1006.8873 1047.9674 1206.1278 1268.4685 1309.1926 1352.2439 1432.0201 1436.3592 1448.8493 1454.6333 1523.9390 1620.0787 3029.7156 3154.6358 3164.9761 3546.7933 3704.3859
redmass: 12.9963 2.8358 8.0148 6.5496 1.2464 7.6396 7.9803 7.4178 10.4492 18.4761 7.1176 5.4770 20.0465 9.7381 28.3997 7.4657 5.3637 1.2202 1.0574 8.4046 10.8338 7.4734 11.5205 11.5367 11.7547 10.8906 12.4805 10.0735 9.3870 1.1813 2.2433 1.7521 2.9623 6.0093 9.7041 7.0079 1.1645 6.3430 1.0519 1.0979 5.8482 2.7134 1.8028 1.0284 1.1042 1.1058 1.0447 1.1060
irintensity: 0.1276 3.0936 2.0217 0.6435 1.5608 0.0854 3.8011 3.4004 1.7417 0.2442 1.8453 2.6321 0.0235 0.1223 0.0409 0.3674 13.9060 291.7640 0.0083 16.8656 62.1493 1.9054 2.7826 93.1913 126.1831 126.1641 0.0758 5.9134 16.0174 7.1932 0.3641 12.3139 26.2860 140.1766 126.4124 45.1629 8.9189 214.3071 16.1049 92.6526 285.5517 345.7735 534.5015 15.4804 8.6010 7.6767 150.7660 59.4099
temp: 298.150 k
press: 1.00000 atm
elementType: 17 17 17 16 7 7 7 7 6 6 6 6 6 1 1 1 1 1
symmnumber: 1
zpe: 279791.3 jmol-1
zpe.correction: 0.106567 hartree
zpe.thermalcorrener: 0.119686 hartree
zpe.thermalcorrenthalpy: 0.120630 hartree
zpe.thermalcorrgfe: 0.065801 hartree
zpe.sumelectzpe: -2189.805055 hartree
zpe.sumelectthermal: -2189.791937 hartree
zpe.sumelectthermalent: -2189.790992 hartree
zpe.sumelectthermalfe: -2189.845821 hartree
dipole: -1.9319 1.8894 -0.0004
dipole: 2.7023
quadrupole: -110.1659 -80.2793 -104.3140
quadrupole: 2.6647 -0.0155 -0.0099
quadrupole: -11.9128 17.9738 -6.0610 2.6647 -0.0155 -0.0099
hfenergy: -2189.9116221 hartree
pointgroup: C01 [X(C5H5Cl3N4S1)]
dipole: 0.7956268 0.7051141 -0.0099703 debye
dipolederiv: -0.3599737 0.0464171 -0.2604051 0.0579286 -0.1807831 0.1578963 -0.2344127 0.1495729 -0.6185248 -0.1233841 0.0029147 0.0002598 0.0185237 -0.6845281 0.029219 -0.0013416 0.0275397 -0.1355807 -0.3844778 0.0826128 0.2664139 0.0923657 -0.2134261 -0.1919309 0.2379284 -0.1839299 -0.555421 -0.3904867 0.5343301 -0.0274063 0.318284 -0.3187531 0.0173077 -0.0186207 0.0196414 -0.0597657 -1.6375452 0.4573136 -0.0512251 -0.0237705 -0.6093847 0.0202903 -0.0307016 0.0297918 -0.0959986 -0.8257484 -0.5093725 0.0054132 -0.1724455 -1.1997643 0.0364106 -0.0082145 0.0303087 -0.1611284 -0.6946481 0.4886471 -0.0298082 0.3600799 -1.5676516 0.0606082 -0.0242494 0.0631877 -0.2051826 -0.2106662 -0.1400661 0.0153278 -0.1238782 -1.6217812 0.0340515 0.0146503 0.0345893 -0.6674618 1.0673239 0.0411026 0.0241045 -0.0803766 0.8646378 -0.0373367 0.0327685 -0.0334446 -0.0443503 0.7644119 -0.1978965 -0.0074397 -0.1165721 1.1762163 0.002567 -0.0117255 0.0004811 1.3338106 1.5089709 -0.7944651 0.0616067 -0.4983548 1.2883866 -0.0591273 0.0486556 -0.0647545 0.0500941 0.8004228 0.0669518 0.0097337 0.1175267 2.2392629 -0.0742567 0.0069211 -0.0761564 0.2540136 0.0071913 -0.0293802 -0.0017274 -0.007402 0.2193557 -0.0085623 -0.0024805 -0.0083663 0.0348756 0.1939103 0.098722 -0.0079297 0.0341701 0.28173 0.0047946 -0.0053776 0.0062373 0.3828915 0.1765085 -0.0742641 -0.001382 -0.0184878 0.3079735 0.0023361 -0.0035344 0.0010331 0.3762829 0.0706396 -0.0983225 -0.0877004 -0.0267993 0.019381 -0.0076689 -0.0696558 0.0017532 -0.0108869 0.0666769 -0.0919341 0.0969072 -0.0209173 0.0167296 0.0071448 0.0736599 -0.0042396 -0.0092547 -0.0291259 0.1166893 -0.0047428 0.0901255 -0.0176015 0.0062568 -0.0042695 0.0067551 0.1315872 unknown
polarizability: 149.4109452|-18.0342008|167.6703093|2.1295453|-3.7047135|82.2452987 unknown
InChI: InChI=1S/C5H5Cl3N4S/c1-13-4-11-2(5(6,7)8)10-3(9)12-4/h9H2,1H3
charge 0 multiplicity 1
18 atoms
Cl -2.879177 0.014799 -1.481022
Cl -2.022026 -2.348875 0.181342
Cl -2.964044 0.165832 1.548979
S  3.166678 -1.18329 0.226925
N  0.455527 -0.77379 0.155713
N  -0.529612 1.435282 0.046031
N  1.89912 1.181356 0.108496
N  0.891759 3.298336 0.004426
C  -0.595529 0.083925 0.097748
C  -2.014574 -0.505717 0.089182
C  1.686365 -0.158806 0.156977
C  0.754998 1.943126 0.054689
C  2.396818 -2.901545 0.275359
H  1.824242 3.7056 0.008623
H  0.057069 3.879144 -0.036422
H  1.785587 -3.060387 -0.622938
H  1.773591 -3.004651 1.17353
H  3.249908 -3.596942 0.302561
