program: Gaussian 09
title: 000299549
version: EM64L-G09RevD.01
frameworkgroup: C1[X(C19H30)]
method: RPBEPBE
basis: SDD
operation: Freq
keyword: #p
keyword: freq=noraman
keyword: PBEPBE/SDD
title: #p freq=noraman PBEPBE/SDD
converged: YES YES NO NO
title: Mulliken charges:
elementType: C C C C C C C C C C C C C C C C C C C H H H H H H H H H H H H H H H H H H H H H H H H H H H H H H
charge: -0.382999 -0.595593 -0.356412 0.383782 -0.357057 -0.469137 -0.379087 -0.360575 -0.331172 -0.356364 0.318314 -0.352126 -0.696642 -0.405000 -0.416478 -0.695514 -0.236670 -0.236901 -0.249015 0.219808 0.208782 0.200530 0.211950 0.185806 0.189334 0.191746 0.188676 0.199174 0.203130 0.190525 0.198440 0.224387 0.176501 0.205422 0.195346 0.194215 0.190659 0.192627 0.210718 0.209721 0.214859 0.238675 0.226559 0.208846 0.211227 0.214857 0.222740 0.222018 0.227369
chargesum: 0.00000
title: Mulliken charges with hydrogens summed into heavy atoms:
elementType: C C C C C C C C C C C C C C C C C C C
charge: 0.045592 -0.183113 0.018728 0.383782 0.023365 -0.066833 0.009878 -0.136188 0.050751 0.033197 0.318314 0.031160 -0.061344 -0.166325 -0.189919 -0.060584 -0.013930 -0.014884 -0.021646
polarizability: 2.05571463e+02 -1.05261347e+01 2.43764283e+02 2.00300860e+01 -1.49717985e+01 1.77364229e+02
1716.lowfreq: -24.1407 -6.6679 -0.0002 0.0003 0.0006 7.8897 10.7787 14.6109 35.4353
frequency: -19.5335 10.4235 35.1521 37.6529 44.3746 60.8449 66.7637 74.9854 96.8677 103.9990 121.7532 133.0905 145.5497 163.2966 187.8559 221.7668 223.6583 235.4895 256.4179 290.1422 328.5187 352.1248 361.5985 389.2275 406.7910 411.3336 441.3144 490.6659 511.9481 593.4985 616.3889 625.3302 700.5863 723.2987 729.0138 729.2991 744.0314 769.8250 778.4947 790.0032 831.8599 849.7359 873.8855 883.0435 886.8385 892.2934 917.0203 924.2203 954.2319 974.0028 976.3137 987.8751 992.0020 994.3141 1009.0181 1014.4288 1028.3071 1037.5294 1055.8667 1066.8128 1079.8491 1080.6324 1084.7412 1104.3589 1113.8025 1118.1938 1147.8969 1172.3983 1191.0990 1193.4713 1196.5146 1213.3133 1225.2932 1239.7881 1262.3215 1273.2193 1276.1771 1278.1819 1281.1555 1286.5082 1289.1052 1293.7309 1311.4156 1315.6538 1321.5155 1333.9648 1345.6072 1352.0245 1352.9909 1359.0589 1378.9817 1386.6403 1392.3420 1433.4505 1455.2401 1462.5018 1462.8948 1465.0941 1467.5276 1472.8369 1475.4759 1477.9764 1478.2810 1478.6032 1482.1139 1487.6791 1488.1157 1494.9416 1579.9689 1608.5734 1649.5990 2947.9366 2952.2825 2954.1682 2956.6729 2963.9312 2965.6995 2969.8235 2971.4591 2972.0186 2972.3261 2983.7437 2985.5819 2995.1412 3001.1979 3010.9256 3021.8550 3031.4584 3034.3437 3041.6228 3055.3809 3068.0655 3068.3992 3070.3021 3071.1587 3075.4035 3119.7133 3126.3673 3140.9317 3148.0547 3163.1520
redmass: 3.4864 3.3541 3.9514 3.6934 1.7173 3.4454 2.4276 1.7862 3.1565 3.2135 1.7227 2.2217 2.3227 2.8672 3.8810 1.5627 1.3570 1.3250 2.7260 3.9029 2.4565 3.8248 3.3646 2.5526 2.8704 2.8945 2.6708 3.1285 3.0575 3.7522 5.9333 3.4050 1.7719 1.0756 1.3858 1.2731 1.4207 1.7447 1.2288 1.3711 1.6638 1.2494 1.5683 1.3508 1.8486 1.5670 1.5933 1.6093 1.9023 1.4161 1.4755 4.5442 1.3616 1.8780 3.1399 2.9322 2.3878 2.1215 2.3989 2.5887 2.2118 2.1851 1.5902 1.9401 2.1701 1.6854 2.2169 1.0519 1.5651 1.4049 1.2131 1.3853 1.2886 1.4340 1.4171 1.2804 1.3057 1.3204 1.1033 1.0633 1.3518 1.1646 1.4123 1.3619 1.3240 1.4068 1.4757 1.6800 1.5954 1.7633 3.7816 1.2166 1.2186 2.2680 1.1067 1.0693 1.0778 1.0761 1.0731 1.0739 1.0428 1.0842 1.1135 1.1729 1.4383 1.1190 1.0884 1.1935 5.6224 6.0529 7.1352 1.0589 1.0607 1.0588 1.0610 1.0617 1.0592 1.0601 1.0399 1.0478 1.0458 1.0638 1.0973 1.0961 1.1006 1.1015 1.1008 1.1002 1.1013 1.0983 1.0988 1.1006 1.1004 1.0993 1.0995 1.0893 1.0840 1.0870 1.0915 1.0956 1.1013
irintensity: 0.0117 0.0087 0.0268 0.0487 0.0159 0.1230 0.0676 0.0150 0.0597 0.4728 0.0194 0.0236 0.2225 0.1916 0.3749 0.0662 0.0434 0.0506 0.0888 0.3517 0.1208 0.7397 0.3419 0.6829 0.1062 0.1618 1.4592 9.0982 0.2096 3.5286 0.0466 1.0166 42.2646 13.6341 13.1994 10.7977 12.7496 49.9900 2.0087 6.7802 1.4653 0.3904 4.7613 17.5794 4.5925 2.4018 3.3850 1.4120 2.8831 0.3351 0.8784 0.2266 0.1333 4.0443 0.8712 5.0624 5.0268 5.1553 3.2427 2.1541 0.3942 1.5424 4.3894 10.1106 11.2554 5.7791 1.6919 0.0147 0.4666 0.1925 0.5956 1.7630 6.0003 0.3677 0.2251 0.5952 0.5464 1.3419 0.5724 0.9688 1.3736 4.8822 0.2841 1.1817 1.3573 1.2113 0.7977 0.7348 2.0742 5.8076 4.1915 11.0084 11.3141 6.8983 2.7352 0.0444 0.6694 2.4332 0.9678 1.4415 12.0345 2.4963 25.1567 6.4437 11.6951 11.4122 18.3933 22.5043 1.9761 12.9417 3.2625 7.5642 2.5521 7.5673 20.0321 24.1911 63.6101 154.5360 18.3291 5.6618 55.5493 71.5690 1.3288 2.3616 0.4264 5.7490 5.9057 21.6441 62.5212 46.6510 78.4313 61.8954 106.5293 58.8254 61.6886 59.1894 4.2453 1.1549 20.9132 47.8700 21.7685
temp: 298.150 k
press: 1.00000 atm
elementType: 6 6 6 6 6 6 6 6 6 6 6 6 6 6 6 6 6 6 6 1 1 1 1 1 1 1 1 1 1 1 1 1 1 1 1 1 1 1 1 1 1 1 1 1 1 1 1 1 1
symmnumber: 1
zpe: 1149401.4 jmol-1
zpe.correction: 0.437784 hartree
zpe.thermalcorrener: 0.459101 hartree
zpe.thermalcorrenthalpy: 0.460045 hartree
zpe.thermalcorrgfe: 0.384536 hartree
zpe.sumelectzpe: -740.523137 hartree
zpe.sumelectthermal: -740.501820 hartree
zpe.sumelectthermalent: -740.500876 hartree
zpe.sumelectthermalfe: -740.576385 hartree
dipole: -0.4426 0.4254 -0.1325
dipole: 0.6280
quadrupole: -120.8728 -112.7995 -119.2895
quadrupole: 0.8439 5.7307 -0.9172
quadrupole: -3.2188 4.8544 -1.6356 0.8439 5.7307 -0.9172
hfenergy: -740.9609213 hartree
pointgroup: C01 [X(C19H30)]
dipole: 0.2079215 0.1231697 0.0513896 debye
polarizability: 212.7617858|17.5089983|236.8508427|22.6826031|11.0245307|177.0873465 unknown
InChI: InChI=1S/C19H30/c1-3-5-7-10-14-18(15-11-8-6-4-2)19-16-12-9-13-17-19/h9,12-14,16-17H,3-8,10-11,15H2,1-2H3
charge 0 multiplicity 1
49 atoms
C  1.12292 -0.930282 0.308882
C  0.134496 -0.626511 1.468156
C  2.35609 -1.739769 0.767994
C  -1.116537 0.112986 1.003413
C  3.377811 -1.984271 -0.365005
C  -0.463512 2.418224 2.018011
C  -0.066375 3.642764 1.140362
C  -1.346404 1.436288 1.277409
C  0.860686 3.280697 -0.041433
C  4.607793 -2.805515 0.085583
C  -2.109488 -0.662433 0.187477
C  1.252094 4.501944 -0.903654
C  5.633453 -3.026701 -1.047056
C  -2.85335 -0.034372 -0.85401
C  -2.341215 -2.049243 0.4122
C  2.182988 4.132929 -2.079339
C  -3.803429 -0.748998 -1.613003
C  -3.290328 -2.768235 -0.346959
C  -4.030942 -2.122722 -1.36308
H  0.592377 -1.485322 -0.490115
H  1.452679 0.028112 -0.140696
H  -0.143741 -1.586316 1.948217
H  0.662293 -0.0456 2.245485
H  2.022204 -2.716304 1.178254
H  2.857446 -1.207477 1.604062
H  2.876511 -2.507867 -1.205752
H  3.718485 -1.007419 -0.767919
H  0.45732 1.934709 2.393501
H  -1.011664 2.79402 2.907562
H  -0.986068 4.12743 0.751395
H  0.436196 4.394153 1.783311
H  -2.295181 1.872347 0.925899
H  1.782223 2.800491 0.351507
H  0.363412 2.522419 -0.679924
H  4.267556 -3.786838 0.475307
H  5.099408 -2.288143 0.935048
H  1.747021 5.26002 -0.262259
H  0.331262 4.980985 -1.295442
H  5.177176 -3.572604 -1.894396
H  6.008907 -2.060866 -1.435047
H  6.503973 -3.612078 -0.697638
H  -2.661296 1.018813 -1.087897
H  -1.791733 -2.571912 1.202655
H  3.123703 3.680496 -1.712183
H  1.699327 3.399174 -2.75152
H  2.448067 5.020972 -2.68236
H  -4.355659 -0.23874 -2.410759
H  -3.45323 -3.832718 -0.142346
H  -4.764226 -2.680915 -1.955796
