program: Gaussian 09
title: 000299574
version: EM64L-G09RevD.01
frameworkgroup: C1[X(C14H25O4P)]
method: RPBEPBE
basis: SDD
operation: Freq
keyword: #p
keyword: freq=noraman
keyword: PBEPBE/SDD
title: #p freq=noraman PBEPBE/SDD
converged: YES YES NO NO
title: Mulliken charges:
elementType: P O O O O C C C C C C C C C C C C C C H H H H H H H H H H H H H H H H H H H H H H H H H
charge: 1.214907 -0.189032 -0.501667 -0.519172 -0.628429 0.302302 -0.310434 -0.248862 -0.745181 -0.731706 -0.134599 -0.277598 0.367103 -0.792883 -0.789275 -0.216952 -0.243486 -0.661017 -0.651632 0.300591 0.264546 0.257500 0.218714 0.217944 0.222703 0.218810 0.232109 0.208026 0.226786 0.222896 0.237852 0.222260 0.230986 0.220129 0.223760 0.232950 0.223168 0.222688 0.228608 0.230966 0.204784 0.223772 0.258038 0.207028
chargesum: 0.00000
title: Mulliken charges with hydrogens summed into heavy atoms:
elementType: P O O O O C C C C C C C C C C C C C C
charge: 1.214907 -0.189032 -0.501667 -0.519172 -0.628429 0.302302 -0.009843 0.015684 -0.051023 -0.058084 -0.134599 -0.069572 0.367103 -0.105349 -0.115899 0.239758 0.202371 0.003341 0.037206
polarizability: 2.57811239e+02 1.76712220e+01 2.02690097e+02 3.13319634e+00 -3.95636132e+00 1.65805801e+02
1716.lowfreq: -11.4537 -6.2174 -0.0011 -0.0006 0.0008 1.0739 6.6934 16.4399 23.5230
frequency: 1.9882 16.3775 23.4085 27.3161 40.8424 57.9810 62.2806 67.7456 91.0491 93.0719 110.6233 117.6838 132.8535 142.7529 162.2085 171.9849 178.9448 193.6832 197.9825 225.7114 233.4131 252.1216 257.0660 259.0083 278.5945 285.4596 335.6024 338.4730 355.4581 366.4626 393.9919 413.7852 431.7697 460.4848 483.9690 495.8850 504.2922 585.8028 598.6291 634.4579 684.7513 757.5952 792.5566 802.5699 805.0270 819.0905 839.8284 855.7796 861.5004 868.8621 948.1310 952.5558 973.2593 987.5758 995.7568 1008.8625 1013.8096 1021.9837 1027.0059 1047.4300 1072.9816 1081.8942 1091.1292 1095.0038 1102.4140 1114.7420 1132.3609 1143.5234 1162.8325 1192.4283 1239.6679 1249.0282 1268.3511 1291.8491 1327.2770 1349.9411 1351.5659 1367.1760 1387.7087 1389.8613 1391.1402 1391.1900 1399.8248 1402.4639 1415.0604 1454.0563 1456.3818 1459.6563 1461.4987 1464.7728 1466.4363 1471.4080 1472.7807 1475.2643 1478.9117 1482.1484 1486.9542 1491.1742 1492.1769 1604.4611 1676.2978 2960.3931 2969.1578 2979.7122 2983.2570 2986.4708 2990.4477 2997.2840 3001.0529 3031.7644 3037.2529 3058.6702 3065.9412 3072.5276 3073.1428 3081.9396 3082.7460 3087.9310 3089.0945 3097.9725 3100.1387 3100.5974 3107.2945 3109.9744 3116.3815 3136.3537
redmass: 3.8457 3.6627 2.9069 2.9096 2.8893 3.1239 2.6489 2.6927 3.3785 1.1826 3.8735 3.4159 3.3173 2.9379 2.0865 1.8154 1.5506 2.2311 2.1737 1.3471 1.7381 1.4879 2.3277 1.8437 3.8616 4.6067 2.8933 4.4075 3.4846 2.6082 3.8461 2.4960 4.4895 2.4227 6.6148 3.3578 3.0925 4.2168 6.5111 6.5901 7.4305 6.7434 3.6001 1.1195 1.0924 3.7585 2.8597 2.3183 2.3954 3.6960 1.3848 1.3540 1.4383 1.2585 1.4046 2.9232 3.2461 1.5311 5.7759 1.6397 1.3475 1.6292 2.5153 2.1452 2.1989 1.7560 1.4258 1.5275 2.6151 1.9537 2.3648 1.1463 1.1228 1.7469 1.6891 1.2265 1.2452 1.7168 1.2258 1.2309 1.2842 1.2476 1.2945 1.2740 1.8930 1.0498 1.0405 1.0541 1.0410 1.0523 1.0761 1.0556 1.0581 1.0741 1.0494 1.1471 1.0538 1.0701 1.0731 9.2663 6.1747 1.0374 1.0391 1.0366 1.0368 1.0363 1.0369 1.0558 1.0611 1.0968 1.0962 1.1079 1.0990 1.1042 1.0984 1.0985 1.0971 1.0978 1.0986 1.0983 1.0959 1.0900 1.1023 1.1034 1.0880 1.0896
irintensity: 1.1496 0.1030 0.6105 0.0250 0.4439 3.3867 1.4171 1.9208 0.5751 0.2858 2.7160 2.4089 0.2054 2.2293 4.9564 3.2359 2.9853 21.9830 4.8284 0.8023 1.7928 2.4023 1.3512 10.6809 0.8070 12.9367 3.7180 12.2321 0.8574 16.5016 4.2458 0.5367 24.4323 13.8853 38.8499 1.9896 8.5013 35.6698 101.0544 96.5883 60.2231 14.0909 58.5427 4.4279 2.7967 4.8415 12.7711 186.7924 89.8951 100.7996 1.4865 2.8821 30.4589 2.9301 5.6088 136.8275 185.3486 18.1370 53.0274 18.9564 3.3920 4.2325 154.5130 9.5989 8.9210 67.0988 4.3582 8.2617 9.3070 7.0451 17.3886 0.9922 0.1040 26.5794 5.7871 19.1202 3.7637 86.4001 22.0691 27.2359 29.3708 33.7531 17.6732 23.4304 50.5941 1.4495 11.0755 14.2871 12.3542 8.3836 2.6283 18.9406 17.9535 3.2641 7.5853 23.3417 9.5081 2.5679 17.7979 167.1310 30.4725 40.8054 49.6516 20.8338 42.1614 22.2238 24.2664 26.0394 41.8143 9.1644 35.5351 11.0771 10.5292 6.8460 33.2453 22.1525 38.6419 29.8136 23.1889 11.8298 32.6310 6.0865 38.9974 25.3705 18.5822 2.3430
temp: 298.150 k
press: 1.00000 atm
elementType: 15 8 8 8 8 6 6 6 6 6 6 6 6 6 6 6 6 6 6 1 1 1 1 1 1 1 1 1 1 1 1 1 1 1 1 1 1 1 1 1 1 1 1 1
symmnumber: 1
zpe: 955627.5 jmol-1
zpe.correction: 0.363979 hartree
zpe.thermalcorrener: 0.389627 hartree
zpe.thermalcorrenthalpy: 0.390571 hartree
zpe.thermalcorrgfe: 0.302784 hartree
zpe.sumelectzpe: -1189.029601 hartree
zpe.sumelectthermal: -1189.003954 hartree
zpe.sumelectthermalent: -1189.003010 hartree
zpe.sumelectthermalfe: -1189.090797 hartree
dipole: 2.9943 0.2957 -1.8798
dipole: 3.5478
quadrupole: -107.2505 -111.8575 -132.5975
quadrupole: -2.0544 8.2951 -2.7317
quadrupole: 9.9847 5.3777 -15.3624 -2.0544 8.2951 -2.7317
hfenergy: -1189.3935805 hartree
pointgroup: C01 [X(C14H25O4P1)]
dipole: -1.3035961 -0.4828532 0.1255314 debye
polarizability: 253.1522235|-21.7067458|170.7725831|-16.8132498|0.8031786|202.3823307 unknown
InChI: InChI=1S/C14H25O4P/c1-7-17-19(16,18-8-2)13(15)12-11(9-10(3)4)14(12,5)6/h9,11-12H,7-8H2,1-6H3
charge 0 multiplicity 1
44 atoms
P  1.957074 0.351177 0.614599
O  0.27116 -1.466973 -0.66556
O  3.30489 -0.161865 -0.365385
O  1.986918 -0.709351 2.006082
O  2.041098 1.911788 0.938757
C  -1.560219 0.920706 -1.743517
C  -0.655963 0.786349 -0.454399
C  -2.196135 0.359622 -0.480823
C  -1.321702 -0.033382 -2.91122
C  -1.843744 2.360571 -2.169375
C  0.340392 -0.267998 -0.293231
C  -3.162342 1.095416 0.368338
C  -4.015737 0.54511 1.285934
C  -4.100341 -0.934538 1.611749
C  -4.975396 1.424327 2.069115
C  3.590747 -1.618413 -0.562029
C  2.687741 -0.231212 3.238311
C  4.973845 -1.693035 -1.203104
C  1.744613 0.588477 4.122999
H  -0.414655 1.732453 0.041487
H  -2.289696 -0.733318 -0.488927
H  -1.077523 -1.053186 -2.571176
H  -2.232922 -0.082759 -3.536624
H  -0.491359 0.324601 -3.547642
H  -2.800557 2.411015 -2.722751
H  -1.906419 3.056817 -1.316059
H  -1.042179 2.723758 -2.837219
H  -3.191753 2.186443 0.239905
H  -3.910745 -1.100052 2.690635
H  -5.119058 -1.320356 1.408953
H  -3.382828 -1.552475 1.049507
H  -4.802791 1.32343 3.159209
H  -4.87262 2.490314 1.802727
H  -6.026873 1.124295 1.888172
H  3.558214 -2.127741 0.419201
H  2.806451 -2.049001 -1.211757
H  3.007264 -1.165764 3.730311
H  3.583013 0.356326 2.957943
H  5.735294 -1.245634 -0.541831
H  4.986291 -1.150676 -2.163817
H  5.244944 -2.748838 -1.392079
H  0.835064 0.009492 4.35974
H  1.455757 1.523658 3.614314
H  2.249285 0.847221 5.073437
