program: Gaussian 09
title: 000299541
version: EM64L-G09RevD.01
frameworkgroup: C1[X(C20H15N3O2)]
method: RPBEPBE
basis: SDD
operation: Freq
keyword: #p
keyword: freq=noraman
keyword: PBEPBE/SDD
title: #p freq=noraman PBEPBE/SDD
converged: YES YES NO NO
title: Mulliken charges:
elementType: O O N N N C C C C C C C C C C C C C C C C C C C C H H H H H H H H H H H H H H H
charge: -0.276892 -0.343405 -0.416057 -0.004643 -0.487778 0.216028 0.020325 0.128234 0.300101 0.384621 -0.548190 -0.227021 0.011358 0.199816 -0.380947 -0.330480 0.455695 -0.210432 -0.226515 -0.740778 -0.436817 -0.344063 -0.195193 -0.226304 -0.253287 0.389911 0.272178 0.352762 0.254264 0.265651 0.236806 0.237528 0.256138 0.255706 0.237750 0.239221 0.244519 0.229686 0.228420 0.232085
chargesum: 0.00000
title: Mulliken charges with hydrogens summed into heavy atoms:
elementType: O O N N N C C C C C C C C C C C C C C C C C C C C
charge: -0.276892 -0.343405 -0.026147 -0.004643 -0.135017 0.216028 0.020325 0.128234 0.300101 0.384621 -0.276012 -0.227021 0.011358 0.199816 -0.126683 -0.064829 0.455695 0.026374 0.011013 0.008816 -0.197596 -0.099544 0.034494 0.002116 -0.021202
polarizability: 5.71007218e+02 -5.46532752e+01 3.13550712e+02 6.00074838e+00 -6.68550372e+00 1.02039123e+02
1716.lowfreq: -7.3226 -3.3492 -0.0003 0.0005 0.0008 4.6776 31.3723 32.9290 54.9233
frequency: 31.2968 32.9051 54.9227 63.1113 80.8620 98.2439 120.5884 161.4968 180.3801 183.7853 198.0445 216.2432 225.6353 279.8263 316.7328 322.9430 333.6267 349.3535 359.4121 390.7090 406.2279 463.9414 468.9783 475.1703 487.2201 504.2759 514.8314 552.2353 557.5790 566.4989 593.1102 604.8458 616.4689 622.7434 651.9438 692.2094 716.0231 718.9240 757.1631 765.0911 765.9987 770.4079 790.6263 795.5599 814.8076 824.1171 841.2865 867.9062 871.5826 890.7967 901.2507 905.3902 948.5625 956.4070 967.9286 985.2093 988.5146 990.2935 1002.7385 1017.2794 1026.6084 1027.5040 1093.5103 1118.3243 1120.1765 1165.7381 1166.2490 1173.6712 1189.9371 1192.0212 1227.4910 1240.8591 1255.7683 1267.0665 1282.2539 1318.1229 1331.2846 1359.1734 1365.7086 1382.7541 1387.1730 1388.1965 1398.5303 1414.7274 1435.7863 1439.7740 1462.0417 1472.5001 1474.0095 1495.6947 1507.6467 1528.4742 1554.4657 1556.0348 1595.6269 1597.9038 1606.6559 1613.6983 1636.7620 2718.1039 2999.3210 3081.8560 3124.8686 3125.7957 3135.0534 3136.2098 3147.0682 3147.7318 3162.8111 3166.9498 3176.7570 3182.9925 3198.2220 3309.8865
redmass: 4.0672 5.9108 4.6741 4.2445 6.0615 5.2786 5.5360 5.2084 1.5737 2.0407 5.3155 7.4488 5.7534 5.1251 5.9815 5.7044 4.3750 5.4937 7.2337 6.7182 2.8973 6.1548 4.9355 3.3401 5.4442 6.7866 3.5739 3.6496 6.9197 5.9019 6.6805 6.6795 6.1313 3.2566 6.2134 1.9466 6.0662 6.2913 2.2012 2.1953 2.1625 2.4302 5.5377 2.7140 2.6519 1.6586 1.5640 1.6443 1.5518 4.6855 4.8880 1.4532 3.1337 1.3627 1.4030 5.1643 1.3295 1.3251 2.0310 2.0897 2.1719 1.7534 1.5676 1.6170 1.1303 2.4802 1.2490 1.0529 1.3409 2.3784 1.9998 2.0851 1.9422 3.3766 1.9863 4.4561 1.4369 3.2192 2.8892 5.6865 1.6710 3.8858 5.7613 1.4104 1.0489 2.3734 3.2302 3.0689 3.1489 3.2379 4.3960 5.4008 4.4167 3.8527 3.8087 2.7662 6.8182 6.0403 8.0483 1.0927 1.0360 1.0943 1.0871 1.1032 1.0875 1.0868 1.0900 1.0939 1.0951 1.0986 1.0999 1.0960 1.0912 1.0740
irintensity: 0.3631 0.6271 0.1761 0.6379 0.1249 3.3662 1.5673 2.7803 0.8807 1.1471 0.8856 4.3704 0.9830 2.0049 12.3952 2.5197 6.0317 0.2939 1.0204 4.3264 0.3073 8.9411 5.3224 5.1159 3.4281 1.8416 24.9319 0.1495 26.7461 8.9395 15.7171 17.1934 12.3843 0.9479 15.8835 38.8679 4.9899 2.2135 32.0028 43.5331 14.3521 67.9586 2.0039 34.0353 18.1965 12.8466 19.3239 35.4628 1.9442 7.2336 14.7926 7.3958 1.1294 1.2305 1.1174 0.4669 0.4493 0.0789 34.3517 9.5200 5.7765 9.2240 12.3568 12.1099 85.1083 9.7845 22.7506 0.6917 3.3741 2.4009 52.5390 2.8488 5.5576 7.5948 15.0956 82.1735 21.7919 91.7423 121.9214 13.2775 67.0201 41.4501 17.0763 36.1973 16.9036 34.6800 3.0485 3.7785 7.0945 52.9799 1158.5341 37.0346 108.5639 57.1524 89.2604 235.5284 417.0404 27.8978 342.3224 373.0453 2.8835 4.5546 9.1613 28.5734 0.6385 0.9560 6.3089 23.4358 16.3039 46.9744 30.2527 2.9708 4.8525 115.7464
temp: 298.150 k
press: 1.00000 atm
elementType: 8 8 7 7 7 6 6 6 6 6 6 6 6 6 6 6 6 6 6 6 6 6 6 6 6 1 1 1 1 1 1 1 1 1 1 1 1 1 1 1
symmnumber: 1
zpe: 797405.6 jmol-1
zpe.correction: 0.303716 hartree
zpe.thermalcorrener: 0.323325 hartree
zpe.thermalcorrenthalpy: 0.324269 hartree
zpe.thermalcorrgfe: 0.254964 hartree
zpe.sumelectzpe: -1084.172543 hartree
zpe.sumelectthermal: -1084.152934 hartree
zpe.sumelectthermalent: -1084.151989 hartree
zpe.sumelectthermalfe: -1084.221295 hartree
dipole: 0.6269 -2.4563 0.0045
dipole: 2.5351
quadrupole: -114.4121 -143.3126 -149.1766
quadrupole: -6.0619 1.7457 -3.0670
quadrupole: 21.2217 -7.6788 -13.5429 -6.0619 1.7457 -3.0670
hfenergy: -1084.4762584 hartree
pointgroup: C01 [X(C20H15N3O2)]
dipole: -0.2315504 -0.9667767 0.0805237 debye
polarizability: 569.2814227|58.7967586|314.9086847|-0.8717368|-11.3799649|102.4069456 unknown
InChI: InChI=1S/C20H15N3O2/c1-12(24)18-19-16(22-14-9-5-6-10-15(14)23-19)11-17(20(18)25)21-13-7-3-2-4-8-13/h2-11,21,23H,1H3
charge 0 multiplicity 1
40 atoms
O  1.368481 2.839912 -0.388604
O  -2.910069 2.976916 -0.534977
N  -2.882342 0.48059 -0.229351
N  -1.455105 -1.918265 0.124655
N  2.707694 0.641136 -0.161546
C  -1.51138 0.535576 -0.207945
C  -0.796798 -0.737272 -0.028265
C  -0.8291 1.788847 -0.343868
C  -3.598933 -0.699012 -0.083258
C  1.342094 0.456289 -0.164226
C  0.633865 -0.732232 -0.012397
C  0.626196 1.786971 -0.3098
C  -2.840617 -1.914033 0.101226
C  -1.610184 3.026129 -0.50868
C  -5.01854 -0.719057 -0.109794
C  -3.553764 -3.141955 0.25933
C  3.788607 -0.268985 -0.142896
C  -5.686567 -1.942093 0.047173
C  -4.953104 -3.155094 0.232362
C  -0.955243 4.37944 -0.653627
C  5.051167 0.231142 0.287654
C  3.69329 -1.620226 -0.57669
C  6.184671 -0.603667 0.300547
C  4.836341 -2.447612 -0.554697
C  6.084695 -1.953723 -0.113082
H  -3.30672 1.460804 -0.361279
H  1.116199 -1.694765 0.159449
H  2.93014 1.654048 -0.188344
H  -5.574014 0.214516 -0.251174
H  -2.966769 -4.054452 0.399036
H  -6.781065 -1.968447 0.028244
H  -5.494501 -4.098973 0.353601
H  -0.32555 4.610159 0.22352
H  -0.260225 4.394855 -1.511419
H  -1.744573 5.137379 -0.776812
H  5.131321 1.273338 0.619699
H  2.75564 -2.015405 -0.97285
H  7.146144 -0.201813 0.638455
H  4.748929 -3.48462 -0.897556
H  6.964985 -2.604546 -0.098114
