program: Gaussian 09
title: 000299586
version: EM64L-G09RevD.01
frameworkgroup: C1[X(C15H15F6NO5S)]
method: RPBEPBE
basis: SDD
operation: Freq
keyword: #p
keyword: freq=noraman
keyword: PBEPBE/SDD
title: #p freq=noraman PBEPBE/SDD
converged: YES YES NO NO
title: Mulliken charges:
elementType: S F F F F F F O O O O O N C C C C C C C C C C C C C C C H H H H H H H H H H H H H H H
charge: 0.886129 -0.145603 -0.117136 -0.153878 -0.157872 -0.155296 -0.117205 -0.242477 -0.405514 -0.523856 -0.526059 -0.253858 -0.262087 -0.416840 -0.401601 0.020546 -0.287456 -0.290505 -0.025161 -0.624239 0.354445 0.179253 -0.368877 0.374827 0.390378 -0.229666 -0.338543 -0.203440 0.256782 0.272029 0.258101 0.241250 0.218080 0.228630 0.227592 0.238862 0.284273 0.307972 0.284488 0.284976 0.292897 0.254157 0.391502
chargesum: 0.00000
title: Mulliken charges with hydrogens summed into heavy atoms:
elementType: S F F F F F F O O O O O N C C C C C C C C C C C C C C C
charge: 0.886129 -0.145603 -0.117136 -0.153878 -0.157872 -0.155296 -0.117205 -0.242477 -0.014012 -0.523856 -0.526059 -0.253858 -0.262087 0.111971 0.097750 0.020546 0.159253 0.175949 -0.025161 -0.031995 0.354445 0.179253 -0.084389 0.374827 0.390378 0.055310 -0.045645 0.050718
polarizability: 2.90154347e+02 -1.03826509e+01 2.17539561e+02 -4.40457314e+00 -8.08065631e+00 1.54239352e+02
1716.lowfreq: -19.1668 -7.7551 -0.0016 -0.0010 -0.0005 2.6385 4.9255 6.9908 14.3321
frequency: -18.1293 -4.2431 14.0951 21.4499 27.4766 42.9300 54.0232 65.7137 94.6511 100.8582 126.1265 140.8598 151.3571 155.7931 178.4924 199.0280 207.6894 213.3252 219.7505 238.0992 239.0657 255.0093 277.2295 291.4147 303.5018 310.3342 312.5822 320.8557 344.8236 371.9582 381.1390 403.1133 410.5186 415.0821 419.4642 457.3900 460.7581 470.7627 479.2451 486.2129 492.5840 507.1270 552.4100 579.5675 605.5291 619.7713 621.1396 648.8346 669.1574 683.9663 705.1543 737.9274 779.2820 782.8891 793.2558 803.0923 809.9873 823.3570 863.5537 871.8318 917.8932 923.3645 930.8398 956.7017 978.6296 984.8674 994.9690 996.9687 1003.8561 1013.3623 1014.8098 1020.9820 1049.0577 1058.7190 1064.3496 1065.2746 1085.3607 1097.5905 1099.1792 1103.3415 1108.6437 1154.6891 1169.1589 1180.0171 1182.9567 1236.3219 1240.9759 1256.3746 1268.6089 1287.9304 1288.3254 1317.6337 1336.9562 1340.6079 1344.2230 1370.5658 1386.3410 1414.3331 1419.4736 1420.3625 1426.7843 1437.6000 1452.7532 1463.6055 1465.1903 1544.9788 1574.8907 1609.0238 2955.7778 2983.3590 2995.7040 3001.2278 3013.4231 3065.7413 3072.3598 3084.5406 3089.9837 3118.1263 3135.3259 3151.6930 3153.2899 3165.2687 3178.7778
redmass: 4.3781 10.2695 7.5460 14.4294 6.9035 12.7377 5.8345 14.9158 7.7880 5.8587 9.1267 7.0994 8.6907 3.9035 6.5504 7.7306 6.5520 6.5761 4.5683 6.7744 7.7394 8.4148 9.1649 11.1974 3.9413 5.9158 4.0885 6.8540 4.4340 5.0043 4.0129 3.0263 10.0140 5.3581 3.2373 11.4533 9.7606 3.4371 4.8752 13.4270 6.2293 5.6114 11.4838 4.4973 7.3946 6.1734 2.3460 7.0172 8.8679 2.3476 1.1395 4.4095 4.9693 7.3893 7.7207 1.8505 3.2417 1.5831 4.8114 2.9485 3.0855 8.0184 1.9225 1.4343 5.5346 10.5636 2.6432 2.9667 4.4700 2.3148 1.4188 1.9539 8.8615 9.8815 3.7500 2.6985 7.5057 2.1121 2.6131 2.5814 5.0840 3.9610 4.1590 1.1840 1.0780 2.1826 1.1683 1.2295 1.5809 1.3882 1.1417 1.2504 1.2982 1.2326 1.7340 1.2407 5.6587 1.0866 2.4817 1.1450 1.5407 1.1409 1.0779 2.4051 1.1070 5.1855 6.0324 7.0294 1.0680 1.0658 1.0599 1.0614 1.0666 1.1007 1.1007 1.0974 1.1015 1.0938 1.0682 1.0908 1.0878 1.0926 1.0997
irintensity: 0.1826 1.1901 0.8547 0.1237 0.4486 0.5649 0.3682 0.9407 2.1403 1.3868 6.2075 1.4589 0.4626 0.9597 10.0527 5.5203 0.6240 2.0782 7.1876 11.3700 3.1869 0.9593 3.2183 1.5377 4.2581 3.2652 4.2254 7.2699 18.7642 18.8593 10.2405 15.9573 1.2819 64.6561 3.9871 7.5847 7.4840 0.6409 8.7594 7.0390 2.4113 58.9374 3.3117 6.0350 65.2276 37.0606 75.2367 20.4284 7.5992 29.6796 66.2416 15.0696 9.7294 25.7223 44.8387 9.9775 43.8085 40.1059 33.9688 1.9846 71.0931 83.9778 6.0969 6.3261 5.9000 43.2652 7.4271 123.1616 59.5341 18.1654 3.7282 16.2123 25.8728 228.1770 34.9732 5.6774 186.7636 10.6872 36.6479 8.1102 10.4186 122.4308 488.1518 19.1012 0.6496 197.1451 27.4076 5.1326 78.9993 6.6143 9.8073 0.3553 0.9327 5.8813 78.2867 4.8930 28.1061 36.6770 61.0103 11.7080 200.3187 67.2452 5.3773 3.9937 18.6254 95.8345 34.0110 11.3248 32.2051 19.3650 6.0261 16.1263 7.1732 15.7057 3.8484 30.5424 22.3926 2.7539 484.5363 6.4789 1.1630 2.9821 5.4581
temp: 298.150 k
press: 1.00000 atm
elementType: 16 9 9 9 9 9 9 8 8 8 8 8 7 6 6 6 6 6 6 6 6 6 6 6 6 6 6 6 1 1 1 1 1 1 1 1 1 1 1 1 1 1 1
symmnumber: 1
zpe: 764632.9 jmol-1
zpe.correction: 0.291233 hartree
zpe.thermalcorrener: 0.317002 hartree
zpe.thermalcorrenthalpy: 0.317946 hartree
zpe.thermalcorrgfe: 0.233928 hartree
zpe.sumelectzpe: -2006.263692 hartree
zpe.sumelectthermal: -2006.237924 hartree
zpe.sumelectthermalent: -2006.236980 hartree
zpe.sumelectthermalfe: -2006.320997 hartree
dipole: 4.1332 3.9862 -2.2879
dipole: 6.1812
quadrupole: -194.6134 -164.1741 -177.9797
quadrupole: 2.1546 -16.0989 -3.3263
quadrupole: -15.6910 14.7483 0.9427 2.1546 -16.0989 -3.3263
hfenergy: -2006.5549254 hartree
pointgroup: C01 [X(C15H15F6N1O5S1)]
dipole: 1.6808034 1.3631118 -1.1094448 debye
polarizability: 284.2142934|-19.1265268|220.5724973|-19.3698896|-6.3537224|157.1464701 unknown
InChI: InChI=1S/C15H15F6NO5S/c16-14(17,18)13(24,15(19,20)21)9-12(23)10-2-1-3-11(8-10)28(25,26)22-4-6-27-7-5-22/h1-3,8,24H,4-7,9H2
charge 0 multiplicity 1
43 atoms
S  3.314603 -0.027076 0.588242
F  -4.408981 -0.181999 2.777048
F  -5.499289 -1.308608 1.149663
F  -3.418453 -1.956956 1.776373
F  -2.359768 -1.591537 -0.781567
F  -2.849437 0.367613 -1.804762
F  -4.486454 -1.150932 -1.428643
O  4.809095 -3.5354 -0.964748
O  -4.578498 1.181178 0.295536
O  4.682628 0.745581 1.029388
O  2.512766 -1.031956 1.607352
O  -2.517772 2.81095 0.033487
N  3.68573 -0.828141 -1.136007
C  5.154166 -1.09524 -1.264733
C  2.851422 -2.058826 -1.335212
C  -3.606386 0.146546 0.500341
C  5.619881 -2.378755 -0.549724
C  3.394688 -3.312018 -0.615367
C  2.049192 1.281099 0.072928
C  -2.243246 0.648772 1.081791
C  -0.248699 2.03092 0.057145
C  -1.70074 1.883326 0.352279
C  0.711808 1.042362 0.405821
C  -4.24908 -0.833192 1.536029
C  -3.346852 -0.575671 -0.871807
C  2.502819 2.444481 -0.56886
C  0.181167 3.218119 -0.60228
C  1.539727 3.425264 -0.908694
H  5.326495 -1.181203 -2.355233
H  5.704246 -0.21411 -0.889856
H  2.857967 -2.223177 -2.430462
H  1.810106 -1.850494 -1.030215
H  5.561131 -2.244106 0.552374
H  6.657028 -2.628348 -0.827101
H  2.860629 -4.215262 -0.952506
H  3.28114 -3.201758 0.482346
H  -1.527524 -0.184099 1.11572
H  -2.436206 0.962992 2.126107
H  0.46181 0.121091 0.942397
H  3.567356 2.586651 -0.780054
H  -0.575519 3.965602 -0.860419
H  1.855498 4.34518 -1.409819
H  -4.073191 2.046632 0.136203
