program: Gaussian 09
title: 000299522
version: EM64L-G09RevD.01
frameworkgroup: C1[X(C8H10N2O2)]
method: RPBEPBE
basis: SDD
operation: Freq
keyword: #p
keyword: freq=noraman
keyword: PBEPBE/SDD
title: #p freq=noraman PBEPBE/SDD
converged: NO YES NO NO
title: Mulliken charges:
elementType: O O N N C C C C C C C C H H H H H H H H H H
charge: -0.389348 -0.319628 -0.364831 0.006938 0.406283 0.368707 -0.581007 0.391356 -0.511629 -0.047654 -0.810574 -0.807611 0.273371 0.263272 0.238936 0.233722 0.231645 0.226202 0.238972 0.226314 0.354276 0.372289
chargesum: 0.00000
title: Mulliken charges with hydrogens summed into heavy atoms:
elementType: O O N N C C C C C C C C
charge: -0.017059 -0.319628 -0.010555 0.006938 0.406283 0.368707 -0.307636 0.391356 -0.248358 -0.047654 -0.106271 -0.116123
polarizability: 1.71938818e+02 -3.88383473e+00 1.33880528e+02 2.36962415e+00 2.12370400e+00 5.54252014e+01
1716.lowfreq: -12.1997 -3.6435 0.0000 0.0005 0.0007 5.7578 83.1368 113.5340 120.0527
frequency: 83.1323 113.5072 120.0497 149.4961 185.0698 188.8903 220.1787 240.8459 281.8727 295.5111 318.6513 352.4200 393.9377 410.9813 467.5656 481.7500 517.8245 611.4424 624.8842 709.2763 725.3096 759.1151 794.5616 844.3126 879.9359 901.9456 905.9653 1001.3031 1010.4518 1032.7829 1051.3463 1109.3559 1144.3445 1180.6762 1218.6926 1244.6427 1276.9671 1288.5128 1367.0013 1391.1209 1402.7829 1412.4172 1441.4440 1458.5322 1472.9342 1475.1225 1477.8293 1503.3329 1530.6611 1639.8490 2971.6609 2974.8487 3043.5715 3047.7403 3059.9203 3088.7210 3095.8464 3149.0815 3172.2990 3491.0775
redmass: 3.9293 1.2757 2.5712 3.4740 2.2374 1.4688 2.1213 3.8890 2.2670 2.6054 4.4614 4.7365 5.1452 4.8790 3.7075 4.5552 6.2966 4.0613 4.0317 5.3222 3.4807 5.6411 1.5076 2.3427 1.3635 2.0019 2.1323 1.4244 1.5458 1.4658 1.6373 4.1676 2.3140 2.1001 4.1098 1.6476 1.9622 1.5662 2.8767 1.2380 1.2920 2.7843 1.8649 1.0476 1.8514 1.0724 1.1794 4.2557 3.7452 6.9315 1.0381 1.0381 1.0971 1.0961 1.0853 1.0981 1.0982 1.0917 1.0912 1.0682
irintensity: 2.2826 1.2642 0.8227 0.0771 1.1676 1.3204 53.5869 0.5426 79.0476 10.9169 11.7812 7.9047 3.9006 18.4103 1.3513 3.3664 2.6845 5.3310 2.0826 20.1885 0.2839 32.9373 158.0194 20.9327 14.7174 61.6385 53.0976 32.2826 2.0844 21.2801 0.0608 13.9422 204.2303 1.4377 164.2464 11.2150 11.6808 7.9484 46.5980 12.9322 22.8427 1.0456 1.6158 1.3975 15.6882 31.2372 0.7724 137.8192 39.5314 83.4094 38.0844 21.1725 27.7439 10.1856 50.5448 23.4110 13.9189 4.3859 1.8441 33.6976
temp: 298.150 k
press: 1.00000 atm
elementType: 8 8 7 7 6 6 6 6 6 6 6 6 1 1 1 1 1 1 1 1 1 1
symmnumber: 1
zpe: 441453.7 jmol-1
zpe.correction: 0.168141 hartree
zpe.thermalcorrener: 0.180158 hartree
zpe.thermalcorrenthalpy: 0.181102 hartree
zpe.thermalcorrgfe: 0.130788 hartree
zpe.sumelectzpe: -569.807724 hartree
zpe.sumelectthermal: -569.795707 hartree
zpe.sumelectthermalent: -569.794763 hartree
zpe.sumelectthermalfe: -569.845077 hartree
dipole: -3.5252 3.8846 1.3137
dipole: 5.4077
quadrupole: -65.3255 -71.1393 -72.0571
quadrupole: 11.6329 4.1214 3.7764
quadrupole: 4.1818 -1.6320 -2.5498 11.6329 4.1214 3.7764
hfenergy: -569.9758649 hartree
pointgroup: C01 [X(C8H10N2O2)]
dipole: -1.4448987 -1.4179563 -0.6543098 debye
dipolederiv: -0.4663604 0.1705791 -0.1588668 0.4221602 -0.8574292 -0.0705937 -0.2635888 0.1409498 -0.0078025 -1.2016019 -0.709896 -0.1192072 0.385769 -0.1122672 0.039819 0.0532068 -0.0040881 -0.251293 -0.6029747 0.3249699 0.1889564 -0.2343474 0.40922 0.0165188 0.3497046 -0.2877873 -0.371025 1.163269 0.9010613 0.1641568 0.2584206 0.113881 0.067244 0.0681242 0.0971113 -0.1532064 0.4835181 -0.0268604 -0.0213018 0.2581883 0.5894897 0.0643069 0.0049956 0.0401561 0.0149365 0.127027 -0.3447817 -0.0296891 -0.4364788 -0.4926064 -0.0567712 -0.0298216 -0.0355855 -0.1009282 -0.6922816 0.2662694 0.0542115 -0.1326725 0.0334225 0.0180558 0.0001199 0.0076102 -0.2353617 0.9144248 -0.4823273 -0.1255644 0.2219285 0.1014464 0.0433553 -0.0125541 0.0574827 0.1980332 0.3606671 0.4075607 0.0526874 -0.0544926 0.1230855 0.0257043 -0.0055263 0.0162119 -0.1048791 -0.5953861 -0.4383168 -0.0630279 -0.4878243 -0.4421639 -0.1042958 -0.1030953 -0.0978193 0.0335073 -0.2441234 -0.1540451 -0.0109759 -0.0754612 0.0164842 -0.0011757 0.0022257 0.0020688 0.0450105 -0.0962173 0.0600242 0.0022505 0.0195208 0.0543113 -0.0018572 -0.0032979 0.0002742 0.0789948 0.0790927 0.0125646 -0.0008836 -0.0177211 -0.0323489 -0.0175791 0.002362 -0.0086855 0.1692276 0.0928364 0.0077327 -0.0006424 0.046602 -0.0357531 -0.0143896 0.0109851 -0.0162117 0.1478695 0.0681064 0.1110045 0.0079211 -0.010205 -0.1248227 -0.0175414 -0.0010658 -0.017623 0.1100218 -0.0031286 -0.0208886 0.0882924 -0.0265891 0.0800995 -0.0594093 0.1219874 -0.0125684 -0.0354408 -0.0035261 -0.0066079 -0.0912622 -0.008318 0.0680335 0.0735325 -0.1280129 0.0258994 -0.0249517 -0.0505424 -0.0006142 0.0790215 -0.0392029 0.0669937 0.0949922 0.1305596 0.0516914 -0.0323315 0.0797205 -0.0722751 -0.0067485 0.0574824 -0.1321938 -0.0190527 0.0047294 -0.0210238 0.111065 -0.0471205 0.0156238 -0.0786489 -0.0130615 0.0869219 -0.074916 -0.1351735 -0.0304994 -0.0596415 0.2465139 0.0736805 -0.0380258 -0.1073203 0.1995018 -0.0209269 -0.16712 0.102585 0.3429275 0.3880872 -0.0944577 0.1073469 -0.026377 0.2866941 0.0149799 0.1002557 -0.0101491 0.1252674 unknown
polarizability: 172.2584523|2.0711396|132.8210561|0.2140421|8.1158738|56.1650387 unknown
InChI: InChI=1S/C8H10N2O2/c1-5-3-7(9-11)8(10-12)4-6(5)2/h3-4,9,11H,1-2H3
charge 0 multiplicity 1
22 atoms
O  2.313933 -2.4257 0.043351
O  2.967032 1.379243 0.180001
N  2.14588 -0.997909 -0.180152
N  1.736815 1.869969 0.227901
C  -1.584408 -0.760028 -0.102152
C  -1.764168 0.674161 0.000115
C  -0.297804 -1.320391 -0.138263
C  0.867762 -0.501011 -0.091044
C  -0.627071 1.478859 0.084678
C  0.698727 0.939425 0.052662
C  -2.796457 -1.66704 -0.163851
C  -3.153948 1.282343 0.029908
H  -0.16796 -2.403999 -0.193576
H  -0.70636 2.566608 0.188354
H  -2.507034 -2.727837 -0.238023
H  -3.43132 -1.546876 0.734851
H  -3.435483 -1.422952 -1.034012
H  -3.750629 0.901142 0.880747
H  -3.101923 2.379911 0.121846
H  -3.724422 1.048718 -0.889719
H  2.918576 -0.325066 0.06585
H  2.76686 -2.75527 -0.780673
