program: Gaussian 09
title: 000026992
version: EM64L-G09RevD.01
frameworkgroup: C1[X(C7H10Cl2N3O2PS2)]
method: RPBEPBE
basis: SDD
operation: Freq
keyword: #p
keyword: freq=noraman
keyword: PBEPBE/SDD
title: #p freq=noraman PBEPBE/SDD
converged: YES YES NO NO
title: Mulliken charges:
elementType: Cl Cl S S P O O N N N C C C C C C C H H H H H H H H H H
charge: 0.046997 0.059161 0.111410 -0.190201 0.664588 -0.445729 -0.458580 0.116984 0.107310 0.132409 -0.207358 -0.221249 -0.655294 -0.646978 -0.256296 -0.227234 -0.255048 0.227730 0.243517 0.232147 0.237597 0.212081 0.247645 0.234159 0.215173 0.239035 0.236024
chargesum: 0.00000
title: Mulliken charges with hydrogens summed into heavy atoms:
elementType: Cl Cl S S P O O N N N C C C C C C C
charge: 0.046997 0.059161 0.111410 -0.190201 0.664588 -0.445729 -0.458580 0.116984 0.107310 0.132409 0.263889 0.248496 0.038591 0.043254 -0.256296 -0.227234 -0.255048
polarizability: 2.78761608e+02 6.57916821e+00 1.97813952e+02 -1.81723606e+01 1.66546860e+01 1.38525884e+02
1716.lowfreq: -10.8734 -6.1014 -2.6590 -0.0033 -0.0024 0.0015 8.5825 10.6907 32.2182
frequency: -4.2993 9.8331 31.9992 44.6176 49.1199 54.0065 70.8885 85.9578 111.8713 118.0654 128.8987 146.9522 152.4211 165.9222 190.4477 200.1074 233.1117 237.7527 259.1338 269.2388 294.3752 315.3391 363.5927 375.7465 424.3084 429.1473 434.7966 475.4119 534.1908 622.9249 623.9857 684.1051 717.6393 772.3081 780.6316 790.5352 811.5283 812.7575 866.3339 880.8742 889.4231 1008.3672 1019.0944 1102.2324 1107.8743 1130.3943 1132.7393 1149.5442 1179.8957 1198.6948 1222.4078 1258.0272 1262.9156 1352.8694 1356.6941 1386.0363 1394.4518 1395.7228 1419.2621 1455.9157 1456.2195 1466.7906 1474.9626 1481.7835 1485.8101 2992.2871 2994.0875 2999.5028 2999.7195 3058.9688 3066.3012 3095.9057 3095.9971 3115.4614 3117.6245
redmass: 6.9919 5.2962 2.9121 2.8897 6.3971 3.8133 3.6661 2.2144 6.2970 13.0604 14.0311 13.8765 10.9836 12.0217 4.3392 21.0330 1.6079 1.3560 2.2913 7.6802 4.7609 5.9779 16.2947 8.6808 12.7207 11.0439 8.6051 14.5237 11.8921 12.3365 12.3572 5.8511 7.4648 13.5858 13.6427 12.7622 1.0924 1.1007 5.2618 13.8043 3.8502 2.2876 2.7819 2.2724 2.2304 1.4244 1.4296 12.6747 12.3856 12.5992 11.9570 1.1375 1.1397 1.2566 1.2469 10.8684 1.2507 1.2344 12.7509 1.0395 1.0389 1.0815 1.0579 1.0553 1.0729 1.0539 1.0529 1.0393 1.0390 1.1087 1.1082 1.0979 1.0979 1.1024 1.1026
irintensity: 0.0668 0.1623 0.1759 0.2232 0.8864 1.7640 1.2545 4.2247 6.0195 0.4887 0.3896 1.2790 0.4046 0.9016 0.0608 0.1170 2.6543 0.2990 2.9397 2.8861 21.6092 20.5447 20.7543 99.6473 12.9877 6.4703 3.7725 1.0190 163.6137 2.0232 1.3730 31.9396 61.7516 169.3239 165.2208 4.5327 2.5165 6.4019 302.4519 2.7043 26.9945 173.3658 13.2907 15.7178 2.4901 1.0289 8.5113 63.5308 319.3865 152.2817 4.1179 0.2145 0.9356 9.8650 2.3817 568.1985 5.8249 26.3637 974.0757 8.6958 19.4217 10.8679 7.8208 9.3418 14.8390 18.4988 20.4011 35.0922 6.3196 8.3502 8.7826 25.4915 15.3540 24.2043 22.3497
temp: 298.150 k
press: 1.00000 atm
elementType: 17 17 16 16 15 8 8 7 7 7 6 6 6 6 6 6 6 1 1 1 1 1 1 1 1 1 1
symmnumber: 1
zpe: 459933.4 jmol-1
zpe.correction: 0.175179 hartree
zpe.thermalcorrener: 0.195188 hartree
zpe.thermalcorrenthalpy: 0.196133 hartree
zpe.thermalcorrgfe: 0.122303 hartree
zpe.sumelectzpe: -2643.580846 hartree
zpe.sumelectthermal: -2643.560837 hartree
zpe.sumelectthermalent: -2643.559893 hartree
zpe.sumelectthermalfe: -2643.633723 hartree
dipole: 1.3249 0.4516 0.8536
dipole: 1.6395
quadrupole: -148.9270 -124.6902 -137.0723
quadrupole: -0.3210 5.6360 -11.1802
quadrupole: -12.0305 12.2063 -0.1758 -0.3210 5.6360 -11.1802
hfenergy: -2643.7560258 hartree
pointgroup: C01 [X(C7H10Cl2N3O2P1S2)]
dipole: 0.5168882 -0.0467117 0.3830502 debye
polarizability: 276.4779997|-19.2490578|193.4203194|-2.6303133|28.6292719|145.2031259 unknown
InChI: InChI=1S/C4H10O2PS.C3Cl2N3S/c1-3-5-7(8)6-4-2;4-1-6-2(5)8-3(9)7-1/h3-4H2,1-2H3;
charge 0 multiplicity 1
27 atoms
Cl -1.510957 3.182196 1.285303
Cl -4.929158 -0.206319 -1.096616
S  0.355132 -0.736006 -1.988208
S  3.77873 -1.583443 -1.258172
P  2.111129 -0.795761 -0.344036
O  2.188339 0.703519 0.47644
O  1.35399 -1.637852 0.952432
N  -2.258991 -0.360188 -1.391137
N  -0.720809 1.211352 -0.368252
N  -3.098942 1.398527 0.046678
C  2.565883 1.937317 -0.286082
C  1.276885 -3.133036 0.877841
C  2.740806 3.025138 0.767329
C  0.704971 -3.579557 2.218647
C  -0.995623 0.117702 -1.151012
C  -1.805205 1.772909 0.207296
C  -3.246195 0.334019 -0.785918
H  3.498771 1.741359 -0.848639
H  1.737887 2.167676 -0.980436
H  0.618705 -3.410577 0.032694
H  2.291724 -3.535332 0.699816
H  3.006555 3.977004 0.271352
H  1.802386 3.171944 1.326982
H  3.543313 2.762658 1.476543
H  0.615186 -4.681479 2.230828
H  1.363941 -3.271995 3.047386
H  -0.295753 -3.146874 2.384239
