program: Gaussian 09
title: 000299500
version: EM64L-G09RevD.01
frameworkgroup: C1[X(C12H12N4O4)]
method: RPBEPBE
basis: SDD
operation: Freq
keyword: #p
keyword: freq=noraman
keyword: PBEPBE/SDD
title: #p freq=noraman PBEPBE/SDD
converged: YES YES NO NO
title: Mulliken charges:
elementType: O O O O N N N N C C C C C C C C C C C C H H H H H H H H H H H H
charge: -0.186837 -0.257541 -0.209687 -0.204339 -0.430423 -0.025022 0.024697 0.016465 -0.451834 -0.362162 0.299325 0.264920 -0.292003 0.063066 -0.497337 0.447155 -0.678135 -0.370093 0.123117 -0.408892 0.230969 0.217426 0.217715 0.217694 0.299317 0.336448 0.213921 0.226396 0.212740 0.293577 0.378049 0.291308
chargesum: 0.00000
title: Mulliken charges with hydrogens summed into heavy atoms:
elementType: O O O O N N N N C C C C C C C C C C C C
charge: -0.186837 -0.257541 -0.209687 -0.204339 -0.052374 -0.025022 0.024697 0.016465 -0.003439 0.073247 0.299325 0.264920 0.007314 0.063066 -0.160889 0.447155 -0.025078 -0.076516 0.123117 -0.117584
polarizability: 3.74950636e+02 2.83478907e+01 2.25213869e+02 -1.02379597e+01 6.72934586e+00 8.23686899e+01
1716.lowfreq: -8.5319 0.0008 0.0008 0.0010 2.3008 4.6540 29.2685 31.9390 44.5278
frequency: 29.1656 31.9139 44.4757 58.9229 67.2069 77.9437 85.9386 105.1279 126.0286 159.2559 164.1522 176.1751 215.7425 234.3449 267.4823 292.8282 304.9535 317.6512 339.9988 370.3758 385.4361 416.1943 446.0298 458.3755 505.0071 516.9933 605.7799 616.5997 640.3255 652.3527 656.6651 669.8339 674.2346 707.1410 709.1932 726.9385 745.6326 754.2045 783.4993 846.9620 861.4161 879.3797 882.0063 891.6370 900.0145 964.4969 1010.8342 1035.7011 1047.4366 1057.2537 1091.7885 1102.1698 1108.3696 1138.1734 1169.7401 1212.1284 1219.7254 1234.5667 1255.0729 1279.4846 1289.3263 1299.7044 1338.8313 1342.6220 1360.0685 1386.1416 1396.3667 1446.2111 1453.1285 1470.5321 1475.2066 1478.3248 1485.9938 1508.1810 1512.0997 1579.2658 1622.6432 2103.6615 2978.4190 2982.5769 2992.3837 3036.0065 3065.7558 3080.3628 3081.3670 3180.0250 3189.0109 3200.3824 3213.0588 3414.8648
redmass: 5.6339 4.2132 5.9813 10.7797 3.7737 8.3705 2.1776 3.8849 5.4498 6.1284 7.5593 6.1583 3.7109 1.2002 4.6892 4.2808 7.1544 7.1531 4.6018 9.8553 5.3777 7.8356 4.3803 5.3964 9.1503 3.7021 5.7316 6.1810 6.3767 7.5244 1.4314 3.6174 1.4481 7.5324 6.4694 5.2288 1.2065 11.6704 3.2661 3.4314 1.4575 1.1828 1.6417 4.0981 2.1109 1.4078 1.3191 2.9782 2.9679 2.1063 2.0060 3.9313 2.0823 1.3588 8.5301 5.0472 1.7958 1.7893 2.6534 1.4035 1.1367 1.9142 2.5170 1.9908 6.9976 5.3768 1.2116 5.4862 1.0987 2.9290 1.0582 1.0493 1.0782 6.8175 3.7978 5.6745 7.3204 6.1982 1.0364 1.0616 1.0607 1.0997 1.0997 1.1018 1.0992 1.0895 1.0919 1.0962 1.0791 1.1556
irintensity: 0.7747 0.2040 0.1058 0.0750 0.6856 1.2937 0.5166 2.8944 0.7391 0.9119 3.1750 1.8919 0.3939 0.0620 17.4001 2.5924 0.0490 2.6934 0.7146 0.7403 2.6692 6.1164 2.2813 18.4593 4.0043 11.6918 1.7079 7.2449 3.0669 11.4773 52.9548 28.3432 41.3542 7.9519 1.8646 2.1426 9.4499 11.1230 4.0432 11.3320 72.0443 49.6910 4.9262 5.6817 4.4028 25.0110 0.0654 22.7750 2.5890 61.6345 24.0069 36.8475 91.1357 58.6853 332.6766 440.1440 40.2786 126.4732 37.1515 2.5184 10.4860 55.7194 141.7341 108.8694 69.3393 44.0258 7.3525 0.3494 7.7999 29.1379 2.9923 11.8245 16.0810 57.1623 139.9723 133.2119 455.3999 14.4448 38.7926 9.8352 36.8809 2.7176 1.9724 64.1583 41.9533 2.8561 20.0257 0.0915 59.8603 96.1991
temp: 298.150 k
press: 1.00000 atm
elementType: 8 8 8 8 7 7 7 7 6 6 6 6 6 6 6 6 6 6 6 6 1 1 1 1 1 1 1 1 1 1 1 1
symmnumber: 1
zpe: 605854.7 jmol-1
zpe.correction: 0.230758 hartree
zpe.thermalcorrener: 0.250016 hartree
zpe.thermalcorrenthalpy: 0.250960 hartree
zpe.thermalcorrgfe: 0.180988 hartree
zpe.sumelectzpe: -982.682786 hartree
zpe.sumelectthermal: -982.663528 hartree
zpe.sumelectthermalent: -982.662584 hartree
zpe.sumelectthermalfe: -982.732556 hartree
dipole: 8.5308 -1.0740 -0.4895
dipole: 8.6121
quadrupole: -133.5836 -122.7487 -115.3916
quadrupole: -2.0124 1.0900 -0.9279
quadrupole: -9.6756 1.1593 8.5163 -2.0124 1.0900 -0.9279
hfenergy: -982.913544 hartree
pointgroup: C01 [X(C12H12N4O4)]
dipole: 3.3561355 -0.4601012 -0.0696595 debye
polarizability: 375.8606124|24.8247103|219.2901019|10.0412403|28.036052|87.3824797 unknown
InChI: InChI=1S/C12H12N4O4/c1-3-5-9(4-2)13-14-11-7-6-10(15(17)18)8-12(11)16(19)20/h2,6-8,14H,3,5H2,1H3
charge 0 multiplicity 1
32 atoms
O  -2.341249 3.074163 0.628107
O  -0.092553 2.73513 0.504856
O  -4.803937 -2.552335 -0.645888
O  -5.512173 -0.436424 -0.150195
N  0.847967 0.364635 -0.055841
N  1.856096 -0.559761 -0.281843
N  -1.330684 2.302891 0.428275
N  -4.583051 -1.308826 -0.363296
C  4.223588 -1.112883 -0.429788
C  5.106339 -1.332362 0.830936
C  -0.471083 -0.030651 -0.127852
C  -1.557587 0.892755 0.103669
C  -0.808753 -1.389115 -0.438413
C  3.110057 -0.111998 -0.203188
C  -2.902436 0.470228 0.025764
C  -3.178917 -0.866494 -0.281091
C  6.239759 -2.344615 0.565218
C  -2.134925 -1.805156 -0.515064
C  3.431565 1.256338 0.09702
C  3.620642 2.452802 0.347789
H  3.766332 -2.069043 -0.741885
H  4.871075 -0.760455 -1.257728
H  5.53586 -0.363935 1.152391
H  4.467052 -1.689865 1.660898
H  0.015451 -2.082911 -0.612554
H  -3.710201 1.184512 0.204165
H  5.834716 -3.327371 0.259788
H  6.852103 -2.499366 1.471576
H  6.911073 -1.991348 -0.239921
H  -2.395558 -2.839891 -0.752109
H  1.024756 1.36662 0.169775
H  3.795577 3.492131 0.565831
