program: Gaussian 09
title: 000299493
version: EM64L-G09RevD.01
frameworkgroup: C1[X(C8H2Cl2N2O2)]
method: RPBEPBE
basis: SDD
operation: Freq
keyword: #p
keyword: freq=noraman
keyword: PBEPBE/SDD
title: #p freq=noraman PBEPBE/SDD
converged: YES YES NO YES
title: Mulliken charges:
elementType: Cl Cl O O N N C C C C C C C C H H
charge: 0.032449 0.082459 -0.369247 -0.363700 0.012995 0.023007 0.252446 0.356178 0.223500 0.119677 -0.299781 -0.340807 -0.202671 -0.300891 0.373208 0.401178
chargesum: 0.00000
title: Mulliken charges with hydrogens summed into heavy atoms:
elementType: Cl Cl O O N N C C C C C C C C
charge: 0.032449 0.082459 0.003962 0.037478 0.012995 0.023007 0.252446 0.356178 0.223500 0.119677 -0.299781 -0.340807 -0.202671 -0.300891
polarizability: 1.96867627e+02 -8.03725755e-01 1.51903073e+02 -2.47605931e-03 -1.34628717e-02 4.55185478e+01
1716.lowfreq: -3.4399 -0.0023 0.0005 0.0021 2.5369 4.4814 64.9508 84.4608 108.7773
frequency: 64.9481 84.4571 108.7772 108.9365 134.1556 163.3152 195.7128 250.7660 266.9059 317.0598 328.1788 336.9244 358.7841 420.4677 424.8201 430.3948 433.9491 468.5657 479.4356 503.3515 508.5823 632.3702 682.7093 719.5585 733.7948 840.4454 844.9176 957.5520 1043.2496 1169.5556 1188.8151 1235.1090 1339.6314 1379.5091 1405.8706 1461.1797 1556.9300 1589.5663 2171.4314 2190.7200 3497.6323 3511.7233
redmass: 17.8085 12.6412 13.9410 12.7756 13.3222 9.2329 31.4441 10.0555 10.2255 6.5717 17.1635 11.8642 14.5072 10.1092 1.3125 1.0977 4.8516 10.2896 12.0378 11.4158 9.7170 11.2736 10.1214 6.9153 8.4288 11.6993 11.1288 11.6994 9.2090 1.5943 1.8650 3.9612 5.1676 8.6436 11.9098 4.7533 9.7775 8.3538 12.6124 12.6262 1.0652 1.0661
irintensity: 0.0437 2.5434 1.0769 0.0681 4.3730 0.6020 0.0433 0.0902 4.3406 24.4157 1.0067 1.3784 2.1518 0.9811 74.7135 220.2513 4.4910 4.8079 0.4081 0.6376 1.5970 0.0822 0.9701 1.4215 56.1835 101.0786 0.0749 30.7001 41.0320 362.6870 35.6216 31.6254 136.7858 76.9426 103.0677 50.2952 14.6765 11.5472 27.0429 7.4795 99.9828 60.0495
temp: 298.150 k
press: 1.00000 atm
elementType: 17 17 8 8 7 7 6 6 6 6 6 6 6 6 1 1
symmnumber: 1
zpe: 218562.3 jmol-1
zpe.correction: 0.083246 hartree
zpe.thermalcorrener: 0.096232 hartree
zpe.thermalcorrenthalpy: 0.097176 hartree
zpe.thermalcorrgfe: 0.043276 hartree
zpe.sumelectzpe: -1485.103466 hartree
zpe.sumelectthermal: -1485.090480 hartree
zpe.sumelectthermalent: -1485.089536 hartree
zpe.sumelectthermalfe: -1485.143437 hartree
dipole: 4.9018 -0.1361 -0.0001
dipole: 4.9037
quadrupole: -115.4608 -92.6616 -92.3257
quadrupole: 11.4750 0.0014 0.0092
quadrupole: -15.3115 7.4877 7.8237 11.4750 0.0014 0.0092
hfenergy: -1485.1867121 hartree
pointgroup: C01 [X(C8H2Cl2N2O2)]
dipole: 1.9289203 0.0368518 0.0000277 debye
dipolederiv: -0.5150915 0.2562421 0.0000268 0.3027297 -0.2554637 -0.0000233 0.000031 0.0000001 0.0134387 -0.5115003 -0.3327628 -0.0000553 -0.301443 -0.1727075 -0.0000271 -0.0000588 -0.0000094 0.0286148 -0.1175545 0.081961 0.0000122 0.2784383 -1.3204423 -0.00014 -0.000018 -0.0001591 -0.362614 -0.055472 0.1213475 0.000003 -0.0526232 -1.3359994 -0.0001323 0.0000508 -0.0001938 -0.3671913 -0.2582825 -0.0080087 -0.0005187 -0.041542 -0.1741621 -0.0003431 -0.000213 -0.0002317 -0.216292 -0.2806988 0.0291075 0.0005394 0.1179994 -0.2565143 -0.0002839 0.0001126 -0.0000827 -0.2092979 0.117106 0.1857092 0.0000542 -0.5079672 0.0746291 -0.0000074 0.0000612 -0.0001352 0.1096761 -0.0279323 -0.0727336 -0.0000401 0.533948 0.0291054 0.000034 -0.0000687 0.0000316 0.0778112 -0.4396888 0.0375954 -0.0000224 -0.1781769 1.1349972 0.0001489 -0.0000815 0.0000873 0.0991363 -0.4243632 -0.31024 -0.0000317 0.0251134 1.1492766 0.0001781 0.0000486 0.0000471 0.0869075 0.8037274 -0.738775 -0.0000692 -0.1904464 0.0676386 0.0000219 0.0000719 -0.0000344 -0.0730696 0.8676387 0.8327088 0.0001225 0.1798385 0.0905797 0.0000353 -0.0000311 0.0000391 -0.0364451 0.2120336 0.0534741 0.0004179 0.1255555 -0.0132471 0.0003059 0.00044 0.0004045 0.0486175 0.2930498 -0.1536218 -0.0004515 -0.2586193 0.0518393 0.0001573 -0.0003006 0.0001318 0.0320342 0.202918 0.0218453 -0.000001 -0.0434227 0.4763402 0.0000218 -0.0000156 0.0000203 0.3788688 0.1341105 -0.0038491 0.000014 0.0106177 0.4541303 0.0000539 -0.0000288 0.0000843 0.3898047 unknown
polarizability: 196.878175|0.4141989|151.8925249|0.0023594|-0.0134838|45.5185478 unknown
InChI: InChI=1S/C8H2Cl2N2O2/c9-5-6(10)8(14)4(2-12)3(1-11)7(5)13/h13-14H
charge 0 multiplicity 1
16 atoms
Cl 3.228424 -1.602308 -0.000245
Cl 3.191368 1.668042 0.000183
O  0.435127 -2.812519 -0.000458
O  0.481517 2.81207 0.000286
N  -3.024535 -2.098217 0.001312
N  -2.993144 2.113386 -0.00162
C  -0.772695 -0.744274 -0.000241
C  -0.78532 0.685771 -0.000027
C  0.468345 -1.429994 -0.00029
C  0.431163 1.429005 0.000089
C  1.672952 -0.675255 -0.000165
C  1.668109 0.730091 0.000019
C  -1.997683 -1.487068 -0.000403
C  -2.009041 1.432059 0.0001
H  1.353597 -3.194511 -0.000472
H  -0.426383 3.217422 0.000333
