program: Gaussian 09
title: 000299506
version: EM64L-G09RevD.01
frameworkgroup: C1[X(C16H15NO2)]
method: RPBEPBE
basis: SDD
operation: Freq
keyword: #p
keyword: freq=noraman
keyword: PBEPBE/SDD
title: #p freq=noraman PBEPBE/SDD
converged: YES YES NO NO
title: Mulliken charges:
elementType: O O N C C C C C C C C C C C C C C C C H H H H H H H H H H H H H H H
charge: -0.232583 -0.272952 -0.105326 0.169832 0.149447 0.029840 0.121680 -0.381414 -0.353641 0.309827 -0.243896 -0.228700 -0.349373 -0.369955 -0.613270 -0.603109 -0.235878 -0.231126 -0.229261 0.267102 0.251728 0.234422 0.234701 0.268824 0.270695 0.231820 0.277149 0.217657 0.212725 0.252159 0.252389 0.232735 0.232539 0.233213
chargesum: 0.00000
title: Mulliken charges with hydrogens summed into heavy atoms:
elementType: O O N C C C C C C C C C C C C C C C C
charge: -0.232583 -0.272952 -0.105326 0.169832 0.149447 0.029840 0.121680 -0.114312 -0.101914 0.309827 -0.009194 0.005722 -0.080549 -0.099260 0.113356 0.114164 -0.003142 0.001412 0.003952
polarizability: 2.41893924e+02 6.31435642e+00 1.93539994e+02 -5.27236609e+00 1.42029420e+01 1.26186006e+02
1716.lowfreq: -13.4057 -7.4554 -0.0003 0.0004 0.0007 5.3556 25.7393 33.4744 47.5948
frequency: 25.4710 33.1459 47.5857 62.9033 70.4385 93.7173 103.4199 120.4299 134.9657 145.3054 194.0810 221.4907 262.0775 265.7849 323.6044 327.7699 360.3758 369.0776 404.1038 406.7081 432.9341 449.4732 558.6765 570.7589 613.3334 627.4133 632.2756 676.1563 688.3312 704.2203 712.3426 729.7702 771.5043 779.0019 810.6743 862.4857 888.0394 908.2610 920.8604 949.1210 963.4316 989.2726 990.9569 995.0813 1005.9582 1025.6147 1034.2888 1050.8849 1058.9091 1084.3037 1090.8458 1109.9757 1144.6044 1158.3191 1174.3863 1177.5597 1189.5910 1216.3364 1245.1992 1274.2162 1283.3320 1320.3250 1367.2588 1385.6372 1388.5713 1410.3373 1424.9768 1433.8004 1436.8732 1460.2171 1469.3328 1471.4397 1479.0479 1482.7539 1497.0254 1536.7739 1571.2207 1575.9028 1588.5200 1598.1542 1608.6532 2969.4391 2975.6214 3049.6752 3052.7070 3116.7353 3117.5113 3128.8335 3129.0402 3138.0317 3139.7304 3149.6795 3151.2125 3160.1485 3166.1951 3169.8797
redmass: 3.8740 3.5042 3.8146 2.5904 3.4948 1.7294 3.9511 1.7047 3.1353 2.6223 4.4011 4.6923 5.1134 3.5156 4.8753 4.3576 5.1307 4.6488 2.8224 2.8441 4.8225 4.0353 3.8922 5.0201 6.4525 5.9328 6.3344 5.7613 4.2495 1.6223 6.9652 5.2276 1.5936 2.3536 3.0084 1.2484 1.6156 3.2356 5.1365 1.4737 1.4154 4.4739 1.4884 1.3433 1.3336 2.2470 2.6977 1.4045 2.2563 1.5839 1.2307 1.9140 1.3988 2.3927 1.0638 1.0673 1.1344 2.9023 5.0456 1.4896 3.6923 1.3520 10.8836 8.6287 2.5053 1.1770 1.9522 2.2682 1.2997 1.0543 1.5435 1.2869 2.0139 1.1978 1.4115 8.6765 5.9104 6.4999 6.3883 6.0931 6.0424 1.0361 1.0364 1.1003 1.1016 1.0967 1.0981 1.0852 1.0853 1.0892 1.0884 1.0944 1.0928 1.0961 1.1008 1.1012
irintensity: 5.9148 1.7930 0.3008 1.9783 0.4669 0.3188 1.9955 0.6121 1.2732 0.3491 0.7261 0.3792 9.1339 3.0308 4.8961 7.4172 14.8059 8.6389 1.4146 2.7383 2.6540 2.5318 9.9565 0.2551 0.1253 5.2944 34.6036 2.7460 4.3227 84.9156 15.4574 5.1546 38.0322 49.8610 11.9409 2.6072 4.9661 10.9646 45.0349 4.2658 1.8585 3.0257 1.2222 0.4441 0.7806 2.8828 32.7034 10.1983 62.8795 8.1429 0.5485 15.2812 4.0535 3.3069 0.6542 2.1543 15.6107 38.3958 49.2760 1.4730 292.3033 12.1109 6.7946 5.5119 66.0476 39.0562 2.1381 16.5171 16.8805 10.9121 4.8713 13.7728 0.4861 32.6040 27.7215 128.3445 271.0772 36.2918 9.8610 11.8530 15.9003 39.2918 88.6518 50.4587 16.2072 19.2444 2.9414 0.2474 0.4063 2.9296 8.1222 33.6370 4.5096 17.4020 27.4150 21.0326
temp: 298.150 k
press: 1.00000 atm
elementType: 8 8 7 6 6 6 6 6 6 6 6 6 6 6 6 6 6 6 6 1 1 1 1 1 1 1 1 1 1 1 1 1 1 1
symmnumber: 1
zpe: 703657.9 jmol-1
zpe.correction: 0.268009 hartree
zpe.thermalcorrener: 0.285718 hartree
zpe.thermalcorrenthalpy: 0.286663 hartree
zpe.thermalcorrgfe: 0.220427 hartree
zpe.sumelectzpe: -822.562638 hartree
zpe.sumelectthermal: -822.544928 hartree
zpe.sumelectthermalent: -822.543984 hartree
zpe.sumelectthermalfe: -822.610220 hartree
dipole: -0.3802 2.2588 -2.5183
dipole: 3.4042
quadrupole: -84.4941 -100.3131 -118.2151
quadrupole: -0.5765 -5.7563 3.9118
quadrupole: 16.5133 0.6943 -17.2077 -0.5765 -5.7563 3.9118
hfenergy: -822.8306469 hartree
pointgroup: C01 [X(C16H15N1O2)]
dipole: -0.1482178 1.0147124 0.8614599 debye
polarizability: 241.5155152|8.3070524|188.8697988|4.6926404|-22.6491616|131.2346098 unknown
InChI: InChI=1S/C16H15NO2/c1-17(2)16(19)14-11-7-6-10-13(14)15(18)12-8-4-3-5-9-12/h3-11H,1-2H3
charge 0 multiplicity 1
34 atoms
O  0.283842 -1.350038 1.127455
O  -1.3970 -1.710478 -1.942186
N  -2.579973 -2.20555 0.0131
C  -0.533682 0.647403 0.071197
C  -1.763339 0.110077 -0.4130
C  0.572248 -0.277797 0.505699
C  -1.880448 -1.349739 -0.818954
C  -0.411387 2.049195 0.259774
C  -2.833427 0.986336 -0.709923
C  2.001914 0.080343 0.23011
C  -1.492233 2.913117 -0.019211
C  -2.70616 2.379414 -0.508105
C  2.37371 0.93077 -0.846396
C  3.014706 -0.508528 1.034906
C  -2.705215 -3.621183 -0.370742
C  -2.933755 -1.87701 1.402261
C  3.736569 1.192277 -1.105422
C  4.373054 -0.234761 0.783797
C  4.737393 0.617856 -0.28756
H  0.525449 2.457608 0.65357
H  -3.765887 0.574008 -1.111225
H  -3.547319 3.042927 -0.736977
H  -1.388367 3.991077 0.144286
H  1.601642 1.35465 -1.49668
H  2.710193 -1.181148 1.843691
H  -2.057092 -4.25566 0.264993
H  -2.387299 -3.727304 -1.419096
H  -3.753238 -3.955591 -0.259181
H  -3.948525 -2.253212 1.629916
H  -2.208314 -2.333428 2.102697
H  -2.917588 -0.788157 1.556572
H  4.018452 1.834902 -1.946543
H  5.148542 -0.684644 1.413233
H  5.794631 0.825663 -0.487654
