program: Gaussian 09
title: 000027021
version: EM64L-G09RevD.01
frameworkgroup: C1[X(C17H20O)]
method: RPBEPBE
basis: SDD
operation: Freq
keyword: #pfreq=noraman
keyword: PBEPBE/SDD
title: #p freq=noraman PBEPBE/SDD
converged: YES YES NO NO
title: Mulliken charges:
elementType: O C C C C C C C C C C C C C C C C C H H H H H H H H H H H H H H H H H H H H
charge: -0.228178 0.322548 0.225815 -0.435607 -0.526625 -0.476204 0.434445 -0.017128 -0.752416 -0.787162 -0.818139 -0.511982 0.443178 -0.398992 -0.392680 -0.253194 -0.255036 -0.235833 0.256535 0.236797 0.242283 0.233574 0.233373 0.240641 0.212091 0.214823 0.217386 0.233265 0.220182 0.225049 0.210604 0.238819 0.220719 0.223855 0.317355 0.227336 0.229177 0.229325
chargesum: 0.00000
title: Mulliken charges with hydrogens summed into heavy atoms:
elementType: O C C C C C C C C C C C C C C C C C
charge: -0.228178 0.322548 0.225815 -0.179071 -0.047544 -0.009257 0.434445 -0.017128 -0.084861 -0.116329 -0.143667 -0.291263 0.443178 -0.175137 -0.075324 -0.025859 -0.025859 -0.006508
polarizability: 2.97171991e+02 2.72405100e+00 1.73314630e+02 -5.24625300e+00 4.96749268e-01 1.20426336e+02
1716.lowfreq: -4.7690 -1.2291 -0.0004 0.0006 0.0008 9.6816 38.5078 54.5965 114.2454
frequency: 38.3825 54.5864 114.2287 116.5782 146.7383 151.3647 169.3686 188.8438 205.9178 218.8440 238.1729 253.1650 272.7339 282.0313 311.7005 321.4148 378.4210 388.9220 407.9091 465.7261 498.2077 507.4984 534.7910 554.9578 566.9561 608.1051 621.4701 634.5854 700.3952 708.0364 731.1774 774.2822 799.1866 815.1418 843.8034 858.2563 863.0935 898.4617 910.8951 927.4545 942.0860 943.8029 960.7163 967.6916 983.1371 988.3418 990.4173 1006.3267 1011.3819 1029.8918 1030.3542 1058.0129 1089.8556 1101.2706 1130.3962 1140.1779 1156.0089 1173.2698 1181.0440 1191.5390 1203.1447 1216.2355 1225.8663 1227.1627 1248.2033 1282.4489 1290.8883 1312.2408 1338.1048 1369.9381 1382.4722 1390.2985 1400.4722 1403.5987 1445.5138 1458.5193 1459.7819 1468.5146 1471.9743 1477.7027 1482.4163 1483.8430 1491.8698 1493.6962 1568.5442 1587.6035 1612.9133 1641.8867 2975.0111 2978.7451 2981.9133 3002.9949 3016.9551 3046.9462 3053.7560 3056.8549 3058.7405 3065.5303 3074.3445 3076.3404 3078.4689 3080.9582 3089.0062 3112.5188 3125.7752 3136.9056 3146.1172 3161.8772
redmass: 4.1310 3.8980 4.1145 4.7080 2.9502 1.1903 1.1412 3.4042 2.3972 1.1341 2.4722 3.6845 3.5914 2.2729 3.2507 2.6269 2.5345 2.9433 2.8928 3.5736 3.9932 2.8571 4.1532 4.7569 4.4152 5.2257 5.2898 4.2459 2.3145 2.5748 2.4379 1.7653 3.6663 2.5459 2.0613 2.4202 1.2821 2.8970 2.1183 1.3741 1.6091 1.5498 1.5450 2.7511 2.2250 3.0139 1.3586 1.9826 2.0669 1.8332 1.4942 1.5456 1.6222 1.7259 2.0764 2.1081 2.1557 1.0889 1.7483 1.8702 1.1429 1.3903 2.0850 2.6099 1.8270 2.4139 1.5328 2.5566 1.5584 2.3562 1.2122 1.2417 1.7359 1.4855 2.1197 1.0595 1.0544 1.0510 1.0593 1.0624 2.0530 1.1009 1.0726 1.0617 6.6600 7.1152 5.8906 8.4622 1.0364 1.0370 1.0363 1.0592 1.0628 1.0874 1.0883 1.1038 1.0992 1.0979 1.0995 1.0994 1.0988 1.1027 1.0976 1.0875 1.0872 1.0929 1.0963 1.1014
irintensity: 0.8272 0.5609 1.2670 0.6539 0.9939 0.2582 0.1317 0.0556 0.2527 0.0700 0.7690 0.1761 5.2344 0.1132 3.1743 0.3991 0.4503 2.0792 0.2785 2.4892 2.8130 8.0815 3.4252 0.4456 13.5628 0.0810 4.0040 2.9037 24.6235 31.7628 10.5732 44.9125 5.4299 14.4564 2.2482 2.3371 1.0991 4.9949 5.6437 0.8550 1.2024 3.7942 18.1200 59.5693 13.8057 2.5631 0.0987 49.7593 32.5562 10.2445 6.2080 44.3885 10.6896 24.1280 0.4295 4.8473 9.3606 0.4083 1.0888 2.7429 10.4410 1.3538 6.9447 3.1902 2.4832 9.5961 2.9423 5.6028 5.8516 13.6263 12.5146 20.6555 8.9621 44.2365 18.6614 5.7837 6.2260 4.7731 6.5135 10.4131 16.6420 10.9570 15.2441 8.8876 79.2292 84.7445 18.5486 101.3587 22.2318 32.6299 46.1750 30.3776 56.0350 0.8494 41.4571 0.7617 3.6698 59.1380 22.2551 21.0275 3.1786 112.6434 28.8027 8.8625 8.4950 28.1973 21.9747 58.9183
temp: 298.150 k
press: 1.00000 atm
elementType: 8 6 6 6 6 6 6 6 6 6 6 6 6 6 6 6 6 6 1 1 1 1 1 1 1 1 1 1 1 1 1 1 1 1 1 1 1 1
symmnumber: 1
zpe: 842847.8 jmol-1
zpe.correction: 0.321024 hartree
zpe.thermalcorrener: 0.337619 hartree
zpe.thermalcorrenthalpy: 0.338563 hartree
zpe.thermalcorrgfe: 0.277921 hartree
zpe.sumelectzpe: -733.702476 hartree
zpe.sumelectthermal: -733.685881 hartree
zpe.sumelectthermalent: -733.684936 hartree
zpe.sumelectthermalfe: -733.745578 hartree
dipole: 0.9649 -2.7747 -0.1175
dipole: 2.9400
quadrupole: -93.7359 -106.5860 -110.3990
quadrupole: 0.2851 -0.7748 0.1027
quadrupole: 9.8378 -3.0124 -6.8254 0.2851 -0.7748 0.1027
hfenergy: -734.0234994 hartree
pointgroup: C01 [X(C17H20O1)]
dipole: -0.4456801 -0.0306412 -1.0669357 debye
polarizability: 296.3019471|6.4855566|120.5068631|-10.1885999|-0.8044936|174.1041467 unknown
InChI: InChI=1S/C17H20O/c1-16(2)14-9-10-17(16,3)15(18)13(14)11-12-7-5-4-6-8-12/h4-8,11,14H,9-10H2,1-3H3
charge 0 multiplicity 1
38 atoms
O  -0.113539 -0.116804 2.052891
C  -2.680074 0.673162 -0.317441
C  -2.359459 -0.191807 0.970553
C  -1.693022 -0.153104 -1.225863
C  -2.631353 -1.660142 0.455365
C  -2.213081 -1.621651 -1.055306
C  -0.377899 -0.070986 -0.439994
C  -0.81124 -0.110405 0.997145
C  -2.279589 2.16109 -0.173898
C  -4.156005 0.61555 -0.769855
C  -3.032546 0.159737 2.292862
C  0.853776 -0.013679 -1.053255
C  2.238104 0.048508 -0.563597
C  3.267412 0.118223 -1.554384
C  2.625627 0.040299 0.811399
C  4.627411 0.178035 -1.195506
C  3.989147 0.099362 1.164665
C  4.995313 0.168667 0.171257
H  -1.613225 0.182776 -2.273341
H  -3.701859 -1.901981 0.583895
H  -2.056945 -2.401112 1.038875
H  -1.426434 -2.356685 -1.296114
H  -3.070408 -1.818445 -1.72296
H  -1.233611 2.294863 0.153768
H  -2.395991 2.684953 -1.141491
H  -2.932092 2.669976 0.55967
H  -4.271428 1.11129 -1.752566
H  -4.55096 -0.409748 -0.864174
H  -4.798423 1.156859 -0.050509
H  -2.838333 1.208938 2.579968
H  -4.12621 0.009163 2.234271
H  -2.637201 -0.47435 3.106376
H  0.797966 -0.006288 -2.155432
H  2.986524 0.12528 -2.615653
H  1.849784 -0.013687 1.581441
H  5.397764 0.231492 -1.972758
H  4.269865 0.091337 2.22397
H  6.052234 0.214813 0.457525
