program: Gaussian 09
title: 000026973
version: EM64L-G09RevD.01
frameworkgroup: C1[X(C7H14Cl2N2)]
method: RPBEPBE
basis: SDD
operation: Freq
keyword: #p
keyword: freq=noraman
keyword: PBEPBE/SDD
title: #p freq=noraman PBEPBE/SDD
converged: YES YES NO NO
title: Mulliken charges:
elementType: Cl Cl N N C C C C C C C H H H H H H H H H H H H H H
charge: -0.070977 -0.068101 -0.168056 -0.089770 -0.276660 -0.285886 -0.598482 -0.588331 0.190356 -0.731524 -0.742587 0.227294 0.231326 0.235417 0.229541 0.262149 0.276320 0.267068 0.262771 0.224541 0.257941 0.226915 0.271089 0.227470 0.230175
chargesum: 0.00000
title: Mulliken charges with hydrogens summed into heavy atoms:
elementType: Cl Cl N N C C C C C C C
charge: -0.070977 -0.068101 -0.168056 -0.089770 0.181960 0.179072 -0.060014 -0.058491 0.190356 -0.022126 -0.013853
polarizability: 1.29711879e+02 2.41259095e+00 1.23506989e+02 1.42820296e+00 7.73101514e+00 8.19835585e+01
1716.lowfreq: -4.1295 -0.0029 -0.0018 -0.0013 7.3695 10.2520 33.8899 48.8129 64.2242
frequency: 33.8325 48.7986 64.1372 72.1430 77.1390 87.4254 128.3350 163.3101 180.7439 203.5097 205.6979 234.3353 307.2558 320.9739 402.3194 437.2456 447.7919 544.3077 556.2360 681.9600 704.9231 774.6347 786.6723 805.2118 841.9359 929.1976 949.0358 974.6309 991.4574 1033.2034 1041.4857 1071.6211 1090.4883 1091.7793 1103.9903 1174.7556 1186.5307 1249.9579 1258.8645 1266.8814 1278.8304 1304.6737 1336.6610 1367.5402 1386.6930 1387.8250 1443.2380 1446.8430 1448.5476 1454.9638 1457.2408 1460.5534 1463.6847 1479.2727 1611.6492 2949.6518 2957.1830 2977.7927 2982.0706 3055.5676 3060.7191 3060.9565 3064.1874 3065.3185 3069.3030 3115.4113 3118.1544 3152.8002 3153.5268
redmass: 3.3205 5.4410 4.1441 3.3213 2.4328 2.7939 1.1084 1.5613 1.5557 5.3674 4.2444 4.2226 3.1411 4.1989 2.7473 3.0416 2.6322 4.1546 4.5935 7.2532 4.8637 2.7498 1.1589 1.4297 3.7089 1.4610 1.2866 4.1789 1.7593 1.4635 2.6371 1.7579 2.0080 1.8840 3.5027 1.5427 1.4112 1.1663 1.2184 3.4128 1.1250 1.1320 1.2877 1.2870 1.3395 1.2578 1.0732 1.0862 1.1007 1.0840 1.0792 1.0752 1.0901 1.0499 5.4428 1.0657 1.0652 1.0377 1.0375 1.0956 1.0961 1.0938 1.0573 1.0614 1.0911 1.0990 1.0990 1.1119 1.1118
irintensity: 2.7592 0.6442 2.5679 0.7505 0.4849 1.7389 0.4847 0.4485 2.0790 6.6598 8.3544 2.6301 0.8453 2.6742 3.6797 12.5873 2.9207 6.9775 22.3437 27.8565 71.5408 10.0939 0.7956 5.1692 0.1594 2.6993 1.0499 16.2663 20.5757 3.3981 7.3715 23.6982 11.6293 30.6254 0.6437 1.7494 0.0096 5.7137 11.0352 17.1444 0.2999 1.6296 0.0561 57.7025 3.5779 33.8838 17.3353 1.0274 25.8430 1.9099 4.8926 0.7787 16.5263 33.1667 43.6303 13.7028 67.9018 5.5226 28.1404 3.4805 2.3338 30.5852 19.0224 14.4747 25.4805 5.8961 12.0813 1.9478 26.4491
temp: 298.150 k
press: 1.00000 atm
elementType: 17 17 7 7 6 6 6 6 6 6 6 1 1 1 1 1 1 1 1 1 1 1 1 1 1
symmnumber: 1
zpe: 536140.0 jmol-1
zpe.correction: 0.204205 hartree
zpe.thermalcorrener: 0.218486 hartree
zpe.thermalcorrenthalpy: 0.219430 hartree
zpe.thermalcorrgfe: 0.160601 hartree
zpe.sumelectzpe: -1303.823084 hartree
zpe.sumelectthermal: -1303.808803 hartree
zpe.sumelectthermalent: -1303.807859 hartree
zpe.sumelectthermalfe: -1303.866687 hartree
dipole: 0.6517 3.2397 1.5542
dipole: 3.6518
quadrupole: -102.8144 -74.7856 -81.9754
quadrupole: 1.6588 0.2679 1.2649
quadrupole: -16.2893 11.7395 4.5497 1.6588 0.2679 1.2649
hfenergy: -1304.0272885 hartree
pointgroup: C01 [X(C7H14Cl2N2)]
dipole: 0.2127109 1.2879406 0.6001688 debye
dipolederiv: -0.6259446 -0.1676756 -0.0236264 -0.20531 -0.2696317 -0.0242874 -0.0654011 -0.0358638 -0.185868 -0.6073173 0.1858674 0.0097552 0.2120501 -0.2776516 -0.0188877 0.0637335 -0.0396751 -0.18407 -0.7652228 0.07229 -0.0304497 0.0117637 -0.3833395 -0.0679243 -0.0177863 0.0557686 -0.3702769 -0.4372517 -0.0428669 -0.0061923 -0.0185908 -0.2471003 -0.0489584 -0.0274039 -0.2708502 -0.2616365 0.4461422 0.2695604 0.0803457 0.1135215 0.0903629 -0.0002826 -0.0796322 0.0594613 0.2613686 0.4165118 -0.3206418 -0.0742514 -0.1193589 0.0782894 0.0039452 0.1000768 0.0432992 0.2464906 0.6334092 0.2689559 0.080127 0.2696889 0.2935955 0.0357688 0.1200548 0.0254768 0.1908006 0.6193008 -0.2843622 -0.0723463 -0.2814058 0.3129796 0.0304848 -0.1263833 0.0327414 0.1848732 0.0030978 0.0639127 0.0840285 0.0712896 0.7049107 -0.0337846 0.1068071 0.1470345 0.4981536 0.0699917 -0.0166102 -0.0099354 -0.0145357 -0.2538521 0.1180924 -0.0142972 0.0430282 -0.0824768 0.0788468 -0.0754266 -0.0903096 -0.0399977 -0.163819 -0.0537907 -0.0724141 -0.0408596 -0.3320621 0.0442079 0.0013971 -0.0232812 0.0226347 -0.1064527 0.0513802 -0.008487 0.0714027 0.0572362 -0.0300892 -0.0291959 0.0029171 -0.0115858 0.0883548 -0.0134427 -0.0794916 -0.0939675 -0.1528439 -0.0330339 0.0316166 0.0077389 0.0155379 0.1006898 0.0019877 0.0854198 -0.0828345 -0.1461904 0.0509694 -0.0026205 0.0196295 -0.0372316 -0.1143726 0.0389493 0.006906 0.0610194 0.0693165 0.0080302 -0.0488459 -0.0513183 -0.0342381 0.0505945 -0.0327886 0.0097949 -0.0302132 -0.1011461 0.024226 -0.0221427 -0.0157314 0.0103615 -0.0917759 0.0263945 -0.0301256 0.0408515 0.0602716 0.0169722 0.01566 0.0170532 -0.0205141 -0.1125257 0.0136587 0.0149648 0.0335279 0.0608411 0.0027925 0.0483186 0.057287 0.0338735 0.0542759 -0.0217123 0.0012042 -0.0177095 -0.0982587 -0.069498 -0.1250482 -0.0224233 -0.0689506 0.0211495 0.0041028 -0.0610984 0.0128206 0.096694 0.1117131 0.0026321 -0.0322596 -0.0087018 0.1156991 -0.0699663 -0.0232156 0.0008478 -0.0873189 -0.0043445 0.1304031 0.0495925 0.0757468 -0.0247887 -0.0182569 0.0863673 -0.0353494 0.0682515 0.1078095 -0.0078522 0.0275121 -0.0171093 0.0558305 0.1482246 0.0069096 0.1051266 0.0543051 0.0294712 0.1336995 0.0617748 0.1046974 -0.035268 -0.0649878 -0.0037173 -0.0549363 0.0772337 -0.0907904 -0.0810247 -0.0456366 -0.0636357 0.1138456 -0.0039188 0.0072148 -0.0301475 0.076312 unknown
polarizability: 129.5030848|2.363359|123.8153157|2.5281714|7.2622419|81.8840258 unknown
InChI: InChI=1S/C7H14Cl2N2/c1-7(2)10-11(5-3-8)6-4-9/h3-6H2,1-2H3
charge 0 multiplicity 1
25 atoms
Cl -4.100568 -1.621914 -0.070242
Cl 3.869274 -1.769733 0.071906
N  -0.101576 -0.533708 0.144976
N  -0.095033 0.703109 -0.713065
C  -1.331097 -1.293189 -0.243585
C  1.12706 -1.318067 -0.205455
C  -2.562603 -0.609658 0.355642
C  2.348245 -0.738906 0.513758
C  0.123711 1.830258 -0.069479
C  0.143367 3.084067 -0.921745
C  0.343683 2.001387 1.4222
H  -1.245534 -2.313124 0.17094
H  -1.43384 -1.360834 -1.348387
H  1.299142 -1.325217 -1.303966
H  0.971245 -2.357955 0.131546
H  -2.517943 -0.570126 1.453745
H  -2.738172 0.387785 -0.071464
H  2.585909 0.284414 0.189981
H  2.249533 -0.795083 1.607172
H  1.105014 3.618907 -0.804926
H  -0.004102 2.830916 -1.982996
H  -0.653101 3.782142 -0.600511
H  0.141246 1.06018 1.955536
H  -0.308051 2.806218 1.810017
H  1.386792 2.313332 1.624903
