program: Gaussian 09
title: 000299465
version: EM64L-G09RevD.01
frameworkgroup: C1[X(C20H16S)]
method: RPBEPBE
basis: SDD
operation: Freq
keyword: #pfreq=noraman
keyword: PBEPBE/SDD
title: #p freq=noraman PBEPBE/SDD
converged: YES YES NO NO
title: Mulliken charges:
elementType: S C C C C C C C C C C C C C C C C C C C C H H H H H H H H H H H H H H H H
charge: 0.182679 -0.851384 -0.852389 0.361772 0.361726 0.602343 0.603174 -0.376594 -0.376599 -0.241429 -0.241456 -0.455458 -0.455519 -0.348248 -0.348128 -0.224327 -0.224279 -0.226794 -0.226767 -0.246189 -0.246199 0.281065 0.281073 0.249546 0.249434 0.229408 0.229406 0.232465 0.232435 0.242409 0.242100 0.226559 0.226554 0.225100 0.225082 0.228718 0.228712
chargesum: 0.00000
title: Mulliken charges with hydrogens summed into heavy atoms:
elementType: S C C C C C C C C C C C C C C C C C C C C
charge: 0.182679 -0.570319 -0.571316 0.361772 0.361726 0.602343 0.603174 -0.127048 -0.127165 -0.012021 -0.012051 -0.222993 -0.223084 -0.105839 -0.106028 0.002232 0.002275 -0.001694 -0.001686 -0.017471 -0.017487
polarizability: 3.22781010e+02 -4.96815760e-03 1.86016768e+02 -1.28605184e+01 -7.98748271e-02 1.77402393e+02
1716.lowfreq: -9.8384 -5.4288 -0.0011 -0.0010 -0.0007 4.7926 9.1095 25.3764 29.3773
frequency: -4.7647 25.3180 29.3138 49.2310 72.5751 73.7219 130.5636 160.9323 219.5145 222.6607 251.5229 256.6522 297.2234 387.2416 397.5728 402.3568 402.7520 434.5181 472.5667 495.3116 501.1802 574.0910 590.4423 613.7311 613.9242 632.1544 634.3441 689.6062 692.7106 701.1864 702.2313 721.9213 759.8893 777.8579 780.4759 812.3725 826.6810 842.5607 850.8616 850.9985 871.3286 883.0519 925.0541 926.3446 955.2094 976.0891 976.1510 989.2037 990.2830 990.3605 994.9480 994.9928 1025.7096 1026.1178 1032.3602 1079.1405 1081.0084 1093.4593 1155.6654 1171.3217 1171.7536 1172.4069 1173.4831 1176.0605 1186.5729 1186.6987 1195.7720 1211.3768 1233.2786 1259.0801 1277.1889 1279.8882 1333.8149 1337.2954 1377.5374 1386.3975 1388.2492 1433.8169 1443.1436 1443.3911 1477.3923 1481.6163 1482.1692 1588.0305 1593.3009 1595.1751 1605.3075 1611.4835 1611.6468 3012.2407 3012.4731 3114.2386 3114.2519 3123.7937 3123.8860 3124.5910 3132.1920 3135.9968 3136.0699 3145.0616 3147.1889 3147.2613 3162.9429 3163.3609 3163.5085
redmass: 6.8982 3.8062 4.0637 5.0254 4.5659 4.9769 6.6670 4.6251 4.4795 4.6154 4.7027 4.9987 6.7005 4.5637 9.8221 2.8201 2.9827 3.4098 4.1997 4.1657 3.6459 5.6724 5.9254 6.0302 6.1236 4.6877 5.6421 5.0677 4.5482 1.6087 1.6631 3.2639 1.6331 1.9163 2.3942 3.3480 3.2091 3.7632 1.2515 1.2559 4.8253 1.5691 1.4792 1.5070 1.4051 1.3913 1.3914 1.4135 6.1095 4.6905 1.3234 1.3230 2.2166 2.1946 2.2045 1.6413 1.5922 2.2398 1.1732 1.2133 1.0593 1.0689 1.7394 1.1905 1.1202 1.1289 2.7659 1.9116 1.5894 1.6593 1.5644 2.0771 1.2885 1.3227 9.5989 7.2800 6.9775 2.2582 2.1655 2.2052 2.5924 2.2990 2.3562 7.0242 6.0563 6.3610 6.4630 6.1008 6.1318 1.0847 1.0846 1.0877 1.0877 1.0859 1.0859 1.0851 1.0894 1.0911 1.0911 1.0948 1.0961 1.0961 1.1007 1.1015 1.1015
irintensity: 0.3882 0.0183 0.0481 0.2021 0.0830 0.4663 1.1992 0.0120 0.8247 0.6381 2.6135 0.8041 2.0372 2.2108 0.0529 0.0389 0.0952 4.2517 2.5062 1.0550 13.3907 14.1497 1.1144 0.1495 2.7229 29.4345 4.2553 5.0693 25.0857 15.9611 106.2580 34.7902 56.4175 23.3572 26.1117 3.9925 2.1442 1.9781 0.1679 0.0997 3.1795 0.1717 0.2239 2.0902 0.9345 0.1826 0.0338 0.3925 1.1076 0.0324 0.0207 0.0757 14.0374 1.0942 6.8039 18.7624 1.7928 6.7030 5.8434 1.1922 0.0076 0.0801 1.4151 2.0736 1.6005 1.4566 0.1984 3.5421 1.1126 5.5532 1.7374 2.3141 2.2393 0.0397 0.6200 0.9909 0.1451 16.6954 2.0117 15.2042 17.7694 30.3434 8.2664 3.6249 1.5640 0.5421 3.7279 0.3380 8.7359 7.5831 11.9812 0.4468 16.1919 1.5863 0.5529 0.9274 4.5771 18.0989 10.7117 22.0672 34.5699 44.1858 30.2644 56.3418 0.2720
temp: 298.150 k
press: 1.00000 atm
elementType: 16 6 6 6 6 6 6 6 6 6 6 6 6 6 6 6 6 6 6 6 6 1 1 1 1 1 1 1 1 1 1 1 1 1 1 1 1
symmnumber: 1
zpe: 770161.5 jmol-1
zpe.correction: 0.293339 hartree
zpe.thermalcorrener: 0.309449 hartree
zpe.thermalcorrenthalpy: 0.310393 hartree
zpe.thermalcorrgfe: 0.247846 hartree
zpe.sumelectzpe: -1168.365454 hartree
zpe.sumelectthermal: -1168.349345 hartree
zpe.sumelectthermalent: -1168.348400 hartree
zpe.sumelectthermalfe: -1168.410947 hartree
dipole: 0.0021 1.9452 0.0101
dipole: 1.9452
quadrupole: -113.1867 -130.9339 -120.0025
quadrupole: -0.0036 -3.3342 -0.0537
quadrupole: 8.1876 -9.5595 1.3719 -0.0036 -3.3342 -0.0537
hfenergy: -1168.6587931 hartree
pointgroup: C01 [X(C20H16S1)]
dipole: -0.0008429 0.7652734 -0.0072684 debye
polarizability: 322.9268984|-0.040367|186.0172877|-12.0067108|0.0418286|177.2559851 unknown
InChI: InChI=1S/C20H16S/c1-3-9-15(10-4-1)19-17-13-7-8-14-18(17)20(21-19)16-11-5-2-6-12-16/h1-14,19-20H
charge 0 multiplicity 1
37 atoms
S  0.000885 -1.705746 0.017833
C  1.20303 -0.402859 -0.743202
C  -1.206287 -0.392953 0.753351
C  0.609147 0.948012 -0.360614
C  -0.611095 0.952704 0.354839
C  2.637135 -0.637726 -0.29775
C  -2.638035 -0.634329 0.303598
C  1.223076 2.172295 -0.719767
C  -1.22458 2.181572 0.698682
C  0.613128 3.396533 -0.371688
C  -0.614114 3.401156 0.335543
C  3.576407 -1.18926 -1.204112
C  -3.582018 -1.17369 1.212374
C  3.05978 -0.324238 1.020526
C  -3.053878 -0.338386 -1.020892
C  4.912666 -1.425304 -0.80603
C  -4.916248 -1.414922 0.810587
C  4.392054 -0.555601 1.419372
C  -4.384111 -0.574918 -1.423471
C  5.324454 -1.108567 0.507585
C  -5.321271 -1.115582 -0.509195
H  1.143286 -0.545349 -1.837917
H  -1.152246 -0.520081 1.850238
H  2.176002 2.162595 -1.260855
H  -2.177543 2.178992 1.239798
H  1.088502 4.343525 -0.650276
H  -1.089062 4.351716 0.60247
H  3.259074 -1.43767 -2.224944
H  -3.270007 -1.408414 2.238079
H  2.337894 0.097987 1.729003
H  -2.32838 0.07454 -1.731175
H  5.627192 -1.854409 -1.517441
H  -5.634481 -1.83448 1.52396
H  4.707276 -0.309326 2.439744
H  -4.694079 -0.342148 -2.448616
H  6.358921 -1.290295 0.820075
H  -6.354174 -1.301277 -0.82451
