program: Gaussian 09
title: 000299474
version: EM64L-G09RevD.01
frameworkgroup: C1[X(C21H16O2)]
method: RPBEPBE
basis: SDD
operation: Freq
keyword: #pfreq=noraman
keyword: PBEPBE/SDD
title: #p freq=noraman PBEPBE/SDD
converged: YES YES NO NO
title: Mulliken charges:
elementType: O O C C C C C C C C C C C C C C C C C C C C C H H H H H H H H H H H H H H H H
charge: -0.451581 -0.264815 0.118265 0.357725 0.034625 -0.052366 0.135421 0.252709 0.310810 0.257352 -0.618026 0.073655 -0.876100 -0.824569 -0.398449 -0.376325 -0.435928 -0.405976 -0.265115 -0.264628 -0.272314 -0.261781 0.088300 0.303692 0.225951 0.278805 0.239057 0.238136 0.245612 0.245374 0.254070 0.267823 0.229306 0.305400 0.230141 0.230482 0.229390 0.231860 0.384011
chargesum: 0.00000
title: Mulliken charges with hydrogens summed into heavy atoms:
elementType: O O C C C C C C C C C C C C C C C C C C C C C
charge: -0.067570 -0.264815 0.118265 0.357725 0.034625 -0.052366 0.135421 0.252709 0.310810 0.257352 -0.314334 0.073655 -0.132286 -0.095447 -0.144380 -0.108502 -0.206622 -0.100575 -0.034974 -0.034145 -0.042924 -0.029922 0.088300
polarizability: 4.48175168e+02 -2.00968427e+01 2.76013403e+02 -5.22228329e-01 2.15762159e+00 1.03225889e+02
1716.lowfreq: -8.1547 -7.0071 -0.0004 0.0001 0.0005 4.2466 24.8358 41.3408 51.7213
frequency: 24.5130 41.3376 51.7066 73.9777 106.0346 113.2029 128.7112 163.6462 182.6960 213.1749 235.5505 271.6610 276.3232 299.8823 323.2013 348.0447 363.8398 371.6392 379.1894 410.9263 424.8661 454.4147 465.2645 494.2923 511.4119 531.1027 555.8544 565.5539 577.8852 593.1635 604.4708 617.1416 646.9114 651.1526 677.2554 702.2816 722.2944 739.4586 762.2898 778.9218 786.6197 805.4137 812.2553 825.1269 877.4299 895.6497 930.8323 935.5987 947.9024 959.1521 975.5696 989.0282 1002.2595 1006.3237 1026.1002 1034.3443 1036.6451 1052.0133 1057.5821 1064.5746 1072.1779 1098.0862 1126.5058 1161.7809 1182.5818 1184.2900 1211.6408 1239.7256 1276.1888 1300.9203 1306.2558 1310.4221 1341.5048 1360.3980 1380.7525 1389.1913 1397.9855 1402.1142 1410.9569 1430.1131 1435.8623 1446.6314 1464.6087 1476.1984 1480.4207 1492.0360 1495.7163 1507.8671 1544.6545 1557.6017 1566.6346 1595.4919 1611.6488 1620.3572 1629.0562 2970.7957 2984.9885 3050.7230 3060.0916 3104.0984 3119.1171 3130.4675 3130.5114 3147.0035 3152.1442 3165.2546 3173.6695 3184.3231 3190.6417 3196.1165 3531.5281
redmass: 2.4865 9.4542 4.0701 1.5589 3.6320 4.0172 2.9910 4.7276 4.3767 4.9914 3.7735 2.8585 2.0058 5.0775 5.0750 2.6920 4.5292 5.3266 3.0031 3.7472 3.3290 3.3336 4.7764 5.6047 3.5064 2.9143 3.4796 2.2126 4.7475 4.8192 2.6847 2.5147 5.5396 5.8783 4.9115 4.6416 4.5124 4.0605 1.3854 2.0131 2.2996 3.3844 2.6759 4.6697 1.9773 1.4099 3.4983 5.4477 1.5389 1.3651 1.3802 1.3403 1.3757 2.9200 2.6168 1.5824 1.6370 2.6084 2.0987 2.6430 2.0285 2.7272 2.0493 1.7274 1.0942 1.0841 1.9164 1.6420 1.6496 1.8714 3.8929 2.2973 4.9231 4.1585 3.8816 3.7297 1.3754 1.2107 2.3685 2.9141 3.8003 2.6836 1.4901 1.2525 1.2082 1.4296 1.2850 2.2478 4.6664 4.9178 7.4758 6.9408 5.8649 6.0849 7.5887 1.0430 1.0434 1.0934 1.0953 1.0965 1.0939 1.0865 1.0857 1.0895 1.0943 1.0930 1.0983 1.0938 1.0941 1.0900 1.0641
irintensity: 0.0497 0.8507 0.5562 0.1700 0.0757 2.0167 1.2983 0.2547 1.2210 0.9976 2.7042 0.8465 0.8486 1.5678 0.1634 2.9077 0.6932 4.1936 0.7854 6.6076 11.2892 0.8169 1.5349 3.3176 1.3630 7.0992 23.5635 60.2311 3.5598 23.9753 46.3804 41.3643 6.7658 2.9431 12.4441 11.4229 8.5309 0.7134 96.2234 20.7201 49.7305 5.8013 6.2466 3.5860 0.2306 1.7384 13.6227 123.3104 13.5838 0.6063 5.9900 0.0240 4.0173 18.3670 2.6820 4.4621 1.1347 25.3141 24.3490 151.7562 105.0723 3.1305 35.4740 13.3609 1.6722 1.3766 12.9456 12.7105 2.4574 42.1028 17.6132 34.9640 4.5094 20.5316 35.8109 18.0583 18.0714 13.8078 1.7913 6.5796 5.4340 50.3906 10.2924 15.6194 2.8143 13.9125 36.7248 27.1453 7.1148 22.5909 2.3259 18.6829 6.5401 95.9940 391.5053 29.8355 23.7522 19.9210 14.1797 7.9101 16.3717 4.8416 3.1147 9.7583 31.7508 30.0809 43.0121 5.1196 18.4296 1.6483 59.8598
temp: 298.150 k
press: 1.00000 atm
elementType: 8 8 6 6 6 6 6 6 6 6 6 6 6 6 6 6 6 6 6 6 6 6 6 1 1 1 1 1 1 1 1 1 1 1 1 1 1 1 1
symmnumber: 1
zpe: 803146.0 jmol-1
zpe.correction: 0.305902 hartree
zpe.thermalcorrener: 0.324470 hartree
zpe.thermalcorrenthalpy: 0.325415 hartree
zpe.thermalcorrgfe: 0.258908 hartree
zpe.sumelectzpe: -958.756188 hartree
zpe.sumelectthermal: -958.737619 hartree
zpe.sumelectthermalent: -958.736675 hartree
zpe.sumelectthermalfe: -958.803182 hartree
dipole: 3.1775 -0.1436 -0.3270
dipole: 3.1975
quadrupole: -129.0058 -110.9060 -139.1431
quadrupole: 0.9134 2.2246 0.4296
quadrupole: -2.6542 15.4456 -12.7914 0.9134 2.2246 0.4296
hfenergy: -959.0620899 hartree
pointgroup: C01 [X(C21H16O2)]
dipole: -1.2491378 -0.0398412 0.1436694 debye
polarizability: 448.6580964|17.6022255|275.4952128|-4.6322507|-0.4633088|103.2611514 unknown
InChI: InChI=1S/C21H16O2/c1-12-14-7-3-4-8-15(14)13(2)20-17-10-6-5-9-16(17)19(21(22)23)11-18(12)20/h3-11,22H,1-2H3
charge 0 multiplicity 1
39 atoms
O  3.115171 -3.267896 -0.278674
O  4.642672 -1.56214 -0.561792
C  -0.136302 0.599374 0.008295
C  -0.200989 -0.853705 0.128242
C  -1.338739 1.313582 -0.250216
C  -1.440494 -1.54877 0.241663
C  1.195131 1.229575 0.144373
C  -2.600434 0.631912 -0.103864
C  -2.658982 -0.795716 0.193438
C  2.402947 0.446112 0.010791
C  1.027556 -1.601434 0.030867
C  2.276519 -1.010626 -0.110929
C  -1.3600 2.738983 -0.791568
C  -1.440071 -3.063936 0.382689
C  -3.842021 1.352451 -0.220086
C  1.337435 2.605328 0.503318
C  -3.954366 -1.402897 0.371165
C  3.672918 1.095221 0.09439
C  -5.075153 0.728876 -0.040619
C  -5.132166 -0.668063 0.259847
C  2.594468 3.21987 0.614367
C  3.770072 2.467048 0.371376
C  3.450497 -1.89536 -0.33284
H  0.981933 -2.690937 0.014275
H  -1.627048 3.49681 -0.02862
H  -0.386835 3.021669 -1.218929
H  -2.107256 2.818918 -1.600931
H  -2.430512 -3.465697 0.636619
H  -1.126465 -3.552401 -0.56005
H  -0.74347 -3.397656 1.171784
H  -3.819983 2.425829 -0.425452
H  0.449639 3.187965 0.753436
H  -4.024752 -2.468237 0.604423
H  4.575105 0.497235 -0.045972
H  -6.001622 1.308175 -0.119682
H  -6.101553 -1.156797 0.405722
H  2.661498 4.274636 0.902801
H  4.75492 2.942494 0.435131
H  3.947032 -3.785797 -0.447686
