program: Gaussian 09
title: 000299447
version: EM64L-G09RevD.01
frameworkgroup: C1[X(C15H10O)]
method: RPBEPBE
basis: SDD
operation: Freq
keyword: #pfreq=noraman
keyword: PBEPBE/SDD
title: #p freq=noraman PBEPBE/SDD
converged: YES YES NO NO
title: Mulliken charges:
elementType: O C C C C C C C C C C C C C C C H H H H H H H H H H
charge: -0.206588 0.140373 0.195313 0.423218 0.405511 0.189843 -0.462599 -0.476516 -0.392375 -0.429511 -0.438558 -0.380110 -0.243915 -0.258814 -0.244247 -0.261878 0.239874 0.240612 0.274928 0.245898 0.243089 0.275441 0.237645 0.235481 0.233861 0.214024
chargesum: 0.00000
title: Mulliken charges with hydrogens summed into heavy atoms:
elementType: O C C C C C C C C C C C C C C C
charge: -0.206588 0.140373 0.195313 0.423218 0.405511 0.189843 -0.222725 -0.235904 -0.117447 -0.183613 -0.195469 -0.104670 -0.006269 -0.023333 -0.010386 -0.047854
polarizability: 2.54910429e+02 -1.08015304e+01 1.98722590e+02 -7.12628307e+00 -3.73638233e+00 6.66107939e+01
1716.lowfreq: -4.4143 -0.6005 0.0007 0.0008 0.0009 10.9696 66.6145 100.2851 114.0729
frequency: 66.6051 100.2819 114.0707 160.6452 224.0980 244.3996 280.4883 324.7264 344.7795 399.1944 413.5242 463.5600 494.0837 500.0717 524.3911 532.0854 561.6407 602.2330 633.2652 706.8562 715.7791 733.5072 759.6097 785.3955 795.5081 811.8580 839.0632 853.6847 885.8371 939.2938 955.8524 969.6698 982.2524 986.3054 989.7162 996.8224 1007.8997 1047.9924 1088.9604 1131.5744 1163.1335 1176.5705 1181.3908 1227.1966 1235.5442 1246.3888 1269.1316 1306.3566 1362.5376 1392.1093 1397.6386 1413.0874 1418.8752 1433.4019 1450.7687 1496.6294 1525.5766 1565.9195 1583.4975 1600.5863 1617.0935 1626.7108 2918.0850 3123.7071 3126.1387 3127.6695 3139.0014 3144.4579 3148.9288 3155.6423 3164.8376 3170.0958
redmass: 6.0745 4.3099 6.2956 4.6300 3.8698 4.3053 4.8793 3.4050 5.5332 5.5550 3.5813 3.8078 4.5316 4.3482 3.7123 6.2463 3.5035 3.3747 6.3627 5.2200 4.3246 3.7896 1.2549 1.5499 4.4940 2.3849 3.5500 1.9022 1.5652 1.3877 1.4481 2.8893 1.4026 3.4956 1.9364 1.4041 1.5949 2.1449 1.9695 1.7265 1.2897 1.1520 1.1597 1.6172 2.2090 2.3108 1.7674 2.1940 2.0970 2.7325 5.5181 1.9123 2.6068 2.8810 2.3669 3.5363 4.3517 6.6738 7.4494 5.8874 6.2449 6.9273 1.0850 1.0865 1.0867 1.0877 1.0888 1.0906 1.0986 1.0940 1.0992 1.0995
irintensity: 3.4702 0.1456 2.2581 0.1489 3.5783 2.5183 0.7870 18.7094 6.4755 1.4297 1.4244 1.5649 1.3518 1.3430 1.9433 3.2235 0.0135 1.0845 6.6363 2.7991 11.5297 39.0206 50.2842 2.2698 6.7359 17.2375 22.4000 62.0449 13.4494 5.7656 5.9354 2.4300 0.7084 1.4832 1.5703 0.6650 3.6038 4.2662 4.4515 14.0089 4.7275 6.8368 2.6913 5.6948 3.0648 23.3181 29.6908 1.7431 1.7428 10.0051 16.6982 0.4868 9.7070 2.4788 10.5342 10.3202 13.8655 123.7230 37.6387 96.6661 5.5902 2.7745 58.7772 0.3940 3.7966 4.4679 5.3780 3.9745 28.4322 32.6145 23.2346 16.9264
temp: 298.150 k
press: 1.00000 atm
elementType: 8 6 6 6 6 6 6 6 6 6 6 6 6 6 6 6 1 1 1 1 1 1 1 1 1 1
symmnumber: 1
zpe: 525616.9 jmol-1
zpe.correction: 0.200197 hartree
zpe.thermalcorrener: 0.211754 hartree
zpe.thermalcorrenthalpy: 0.212698 hartree
zpe.thermalcorrgfe: 0.162596 hartree
zpe.sumelectzpe: -651.758917 hartree
zpe.sumelectthermal: -651.747360 hartree
zpe.sumelectthermalent: -651.746416 hartree
zpe.sumelectthermalfe: -651.796518 hartree
dipole: -2.1961 -3.5305 0.0779
dipole: 4.1585
quadrupole: -81.5377 -91.0499 -97.1009
quadrupole: -11.7702 -0.9559 -1.4153
quadrupole: 8.3585 -1.1537 -7.2048 -11.7702 -0.9559 -1.4153
hfenergy: -651.9591137 hartree
pointgroup: C01 [X(C15H10O1)]
dipole: -0.7154352 1.4678427 0.101598 debye
dipolederiv: -0.4984352 0.4477658 0.0361621 0.298145 -1.0970619 -0.1441594 -0.0432396 -0.0351788 -0.3556107 0.2726296 -0.1773178 -0.0809043 0.1104296 0.0575878 0.0331866 -0.0797545 -0.0425328 -0.0240636 -0.0075397 0.1587951 0.0004653 0.0547531 -0.0290322 -0.0188575 -0.0683531 -0.0067718 -0.0054778 -0.0974572 -0.1606968 0.0018869 -0.2665433 -0.0955967 -0.0263118 0.0307053 -0.0517116 0.0466052 0.0619669 0.1310659 -0.0037713 0.1385254 0.0296667 0.033943 0.0320318 0.0525687 0.0613264 -0.0608588 -0.2900362 -0.1040931 0.0359243 -0.6111558 -0.1394164 0.0286954 -0.2227408 -0.1055341 -0.0158338 0.0582936 0.023893 -0.0931149 0.1168757 0.0230517 0.0317229 0.0223737 -0.171312 -0.0465063 -0.1046297 0.0235192 0.0032538 0.100969 -0.0216041 0.0018903 -0.0176639 -0.1704482 -0.069238 -0.1089739 0.0319837 -0.0389694 -0.0204075 -0.0510708 0.0685895 -0.044923 -0.1163163 0.1517034 -0.0077481 -0.0051429 0.0680141 0.1608934 0.01747 0.0109526 0.0201393 -0.1475651 -0.0443784 -0.1137737 0.0092691 -0.2121416 0.0417228 -0.0195552 0.0186889 -0.0165389 -0.1743452 -0.1409418 0.1606952 0.0478652 -0.1122004 0.0884464 0.0325797 -0.043085 0.1132246 -0.0775523 0.0847285 0.0852728 0.0484557 0.2347201 -0.2064463 -0.0116127 0.0679797 -0.0043425 -0.1563449 -0.0776789 0.0825605 -0.0044058 0.0365758 0.073006 -0.0603555 0.0032174 -0.0580106 -0.1485994 0.1186275 0.0079551 0.0135155 0.0338912 -0.0304617 -0.0121439 0.0057136 -0.0163269 -0.1492756 0.5007186 -0.199023 0.2256088 -0.3635946 1.4775504 0.3180285 0.1671427 0.2772259 0.3228124 0.0446495 -0.1060925 -0.0125303 -0.0284917 -0.0787547 -0.0097259 -0.0151491 -0.0054743 0.1541495 -0.009346 0.1308138 -0.0145696 0.0559061 -0.0253408 0.0098899 -0.0158618 -0.0007603 0.1536842 0.0126429 0.098141 -0.0324205 0.069016 0.0038463 0.0308304 -0.0517345 0.0446397 0.1339184 0.0787582 -0.0153347 -0.0076171 -0.082668 -0.0900652 -0.0238268 -0.0257957 -0.010091 0.1505244 0.0146186 0.0577862 -0.0088198 0.1277164 -0.048804 0.0212636 -0.0141564 0.009115 0.1543025 0.0497887 0.0376079 0.0002137 0.0863464 0.0542152 -0.0172426 0.0062608 -0.0359607 0.1437122 -0.117239 -0.0475849 -0.0329838 -0.0382873 0.0794166 -0.0178923 -0.0141104 -0.0236337 0.1541574 0.0489239 -0.0591051 0.0095661 -0.0916428 -0.0723786 0.0420888 0.0112122 0.0507171 0.1525811 -0.1373889 -0.033101 -0.0043411 -0.0327908 0.0915977 0.0093355 -0.006668 0.0109546 0.1608443 -0.1169144 -0.0333356 -0.1608047 0.0072277 0.0297111 0.0021074 -0.1068948 -0.0082971 0.0138274 unknown
polarizability: 256.6910163|4.3577597|196.9488871|4.3003376|6.310264|66.6039096 unknown
InChI: InChI=1S/C15H10O/c16-10-13-6-3-5-12-9-8-11-4-1-2-7-14(11)15(12)13/h1-10H
charge 0 multiplicity 1
26 atoms
O  2.074016 -3.299482 -0.614267
C  0.607365 0.095044 -0.058211
C  -0.838335 -0.142677 -0.01109
C  1.081513 1.455316 0.065963
C  -1.73868 0.98634 -0.106081
C  1.601145 -0.943688 -0.204568
C  0.144443 2.556142 0.025769
C  -1.209623 2.331453 -0.113386
C  -1.420898 -1.434094 0.199119
C  2.477837 1.718156 0.206013
C  -3.150394 0.770273 -0.125153
C  2.973767 -0.647861 -0.028411
C  3.415026 0.675979 0.206582
C  -2.810606 -1.622243 0.195424
C  -3.685873 -0.517186 0.001086
C  1.302657 -2.306735 -0.735487
H  0.538979 3.576773 0.088806
H  -1.912626 3.16954 -0.182295
H  -0.781504 -2.289598 0.432873
H  2.807229 2.758757 0.311013
H  -3.813847 1.638421 -0.216238
H  3.687969 -1.47162 -0.135445
H  4.481757 0.885778 0.334443
H  -3.222584 -2.622555 0.365718
H  -4.770162 -0.670701 -0.009479
H  0.37853 -2.391035 -1.353696
