program: Gaussian 09
title: 000299435
version: EM64L-G09RevD.01
frameworkgroup: C1[X(C8H16N2O4)]
method: RPBEPBE
basis: SDD
operation: Freq
keyword: #p
keyword: freq=noraman
keyword: PBEPBE/SDD
title: #p freq=noraman PBEPBE/SDD
converged: YES YES NO NO
title: Mulliken charges:
elementType: O O O O N N C C C C C C C C H H H H H H H H H H H H H H H H
charge: -0.294792 -0.294791 -0.258954 -0.258957 -0.357351 -0.357352 -0.358796 -0.358796 -0.262791 -0.262792 -0.678514 -0.678513 0.318764 0.318766 0.212969 0.238402 0.238400 0.212968 0.229220 0.216715 0.229221 0.216715 0.216819 0.226696 0.207639 0.216819 0.226695 0.207639 0.343977 0.343976
chargesum: 0.00000
title: Mulliken charges with hydrogens summed into heavy atoms:
elementType: O O O O N N C C C C C C C C
charge: -0.294792 -0.294791 -0.258954 -0.258957 -0.013374 -0.013376 0.092574 0.092572 0.183144 0.183143 -0.027361 -0.027360 0.318764 0.318766
polarizability: 1.48617260e+02 -3.66249598e-04 1.06155326e+02 4.07922910e+00 -1.60128908e-04 9.33751548e+01
1716.lowfreq: -6.1611 -3.1012 0.0006 0.0008 0.0008 5.1943 18.4338 33.7754 43.8100
frequency: 18.4131 33.7530 43.6376 61.4396 64.9410 73.9125 85.4332 92.2388 92.6928 220.4474 224.2862 227.1013 251.5798 267.3947 269.2030 280.3558 311.0709 317.0264 402.0737 468.2964 502.0484 584.7140 605.8981 659.9943 667.5071 699.5413 717.6468 760.1953 760.2571 872.5398 876.4066 884.5668 886.1539 919.4706 920.5891 977.7960 1004.9388 1046.7981 1046.7993 1120.1940 1121.3036 1157.9025 1162.4060 1167.8031 1169.1773 1248.5489 1248.5696 1292.9949 1293.0060 1307.6082 1308.6799 1309.4077 1370.2420 1370.5371 1394.5442 1394.5654 1452.3599 1453.9835 1465.7215 1467.6179 1476.3092 1476.5073 1480.8023 1480.8280 1487.4045 1487.4458 1667.2090 1690.0626 2978.1429 2978.2232 3002.6651 3002.6913 3020.3111 3020.5033 3049.8542 3049.8620 3074.9752 3075.0008 3083.6108 3083.6201 3102.4332 3102.4769 3546.1943 3552.8383
redmass: 3.9871 3.2047 5.0019 3.6748 2.5308 2.2880 5.4668 3.0704 4.4644 2.4207 1.1599 1.3755 2.9896 2.9356 3.0732 4.5650 4.6293 4.8081 5.3751 1.2483 4.9632 1.3669 4.4816 4.0182 5.7144 9.3337 7.1998 1.1042 1.1055 2.4361 2.0881 1.2604 1.3377 3.2024 3.2129 6.2066 7.2363 3.0023 3.0192 2.2509 2.2496 2.3041 1.8387 2.1843 5.2929 1.2236 1.2225 1.1011 1.0998 1.9093 1.3114 1.5339 1.3308 1.3333 1.2027 1.2028 1.1318 1.1202 1.4414 1.7186 1.0556 1.0541 1.0418 1.0418 1.0830 1.0831 9.9534 8.6259 1.0360 1.0360 1.0605 1.0605 1.0580 1.0581 1.1007 1.1007 1.1020 1.1020 1.0989 1.0989 1.1082 1.1082 1.0798 1.0773
irintensity: 0.4486 0.1612 5.4896 1.3753 1.5642 1.2851 1.4370 0.6860 2.7751 0.0455 0.8998 0.2937 8.1853 0.0180 2.8552 4.7083 30.1641 6.7282 24.9461 45.7824 0.5516 186.7851 1.4714 50.1569 16.4364 26.9581 3.8490 0.2726 9.7377 5.0497 11.9690 0.5605 8.5261 8.0842 0.0193 60.8376 238.1303 9.5706 18.4590 62.2343 3.0794 489.6080 11.4192 289.0537 47.1832 1.7742 4.7594 0.4806 5.7333 0.1818 4.6636 4.1131 3.5905 0.0989 18.0536 8.5059 24.9625 3.5411 263.3772 91.4174 2.1180 12.1690 21.8401 3.9979 9.2831 28.3248 280.2346 147.4603 53.6202 15.9554 0.0840 16.1754 100.9410 2.4672 1.0950 1.4429 47.8343 11.1440 42.2708 34.9765 72.7243 14.1706 28.8338 49.9340
temp: 298.150 k
press: 1.00000 atm
elementType: 8 8 8 8 7 7 6 6 6 6 6 6 6 6 1 1 1 1 1 1 1 1 1 1 1 1 1 1 1 1
symmnumber: 1
zpe: 648652.9 jmol-1
zpe.correction: 0.247059 hartree
zpe.thermalcorrener: 0.263933 hartree
zpe.thermalcorrenthalpy: 0.264878 hartree
zpe.thermalcorrgfe: 0.199364 hartree
zpe.sumelectzpe: -723.716384 hartree
zpe.sumelectthermal: -723.699510 hartree
zpe.sumelectthermalent: -723.698566 hartree
zpe.sumelectthermalfe: -723.764079 hartree
dipole: 0.0001 -0.9936 -0.0002
dipole: 0.9936
quadrupole: -64.1726 -78.1099 -88.6866
quadrupole: -0.0003 2.2885 0.0004
quadrupole: 12.8171 -1.1202 -11.6969 -0.0003 2.2885 0.0004
hfenergy: -723.9634431 hartree
pointgroup: C01 [X(C8H16N2O4)]
dipole: 0.0000344 0.0000063 0.3909082 debye
polarizability: 148.7428653|3.112176|93.2495504|0.0008613|0.0031008|106.1553257 unknown
InChI: InChI=1S/C8H16N2O4/c1-3-5-13-7(11)9-10-8(12)14-6-4-2/h9-10H,3-6H2,1-2H3
charge 0 multiplicity 1
30 atoms
O  -2.790439 -0.187924 1.399889
O  2.790289 0.188618 1.399966
O  -1.267611 1.375769 0.489707
O  1.26745 -1.375311 0.490211
N  -0.673857 -0.159627 2.182892
N  0.673659 0.160666 2.182853
C  -3.805154 -0.442021 -0.866054
C  3.805277 0.441844 -0.865958
C  -3.857167 0.297532 0.477049
C  3.857073 -0.297248 0.477408
C  -4.961844 0.001694 -1.789543
C  4.962009 -0.002329 -1.789173
C  -1.54486 0.431777 1.262874
C  1.54468 -0.431043 1.26305
H  -3.859698 -1.531527 -0.682669
H  -2.833692 -0.237693 -1.352422
H  2.833841 0.237455 -1.352352
H  3.859926 1.531409 -0.682951
H  -3.733307 1.386766 0.3359
H  -4.792055 0.089173 1.023696
H  3.733132 -1.386519 0.336617
H  4.791922 -0.088786 1.024084
H  -4.910404 1.08554 -2.003753
H  -4.916557 -0.53317 -2.75458
H  -5.947906 -0.209091 -1.333951
H  4.910459 -1.086243 -2.003015
H  4.916886 0.532207 -2.7544
H  5.94805 0.208494 -1.333553
H  -0.97949 -0.991277 2.69103
H  0.979288 0.992465 2.690749
