program: Gaussian 09
title: 000299436
version: EM64L-G09RevD.01
frameworkgroup: C1[X(C11H16N2O)]
method: RPBEPBE
basis: SDD
operation: Freq
keyword: #p
keyword: freq=noraman
keyword: PBEPBE/SDD
title: #p freq=noraman PBEPBE/SDD
converged: YES YES NO NO
title: Mulliken charges:
elementType: O N N C C C C C C C C C C C H H H H H H H H H H H H H H H H
charge: -0.241023 -0.265003 -0.428554 0.271623 -0.706290 -0.684286 -0.718240 0.193771 0.270103 -0.371082 -0.362508 -0.232231 -0.219638 -0.228082 0.203973 0.222747 0.207948 0.256688 0.211842 0.202436 0.197767 0.210666 0.248294 0.269366 0.294056 0.231602 0.272114 0.228585 0.231643 0.231713
chargesum: 0.00000
title: Mulliken charges with hydrogens summed into heavy atoms:
elementType: O N N C C C C C C C C C C C
charge: -0.241023 0.004363 -0.134498 0.271623 -0.071623 -0.013319 -0.061513 0.193771 0.270103 -0.139481 -0.090394 -0.003646 0.012005 0.003631
polarizability: 1.85372406e+02 -4.05434729e+00 1.31914692e+02 -1.55337889e+01 -8.10198631e+00 9.10871948e+01
1716.lowfreq: -1.6956 0.0001 0.0003 0.0005 6.2695 15.2394 37.5783 43.2613 50.5029
frequency: 37.3894 43.2352 50.3803 80.2507 135.0781 164.5834 188.6562 236.4977 243.3052 260.7004 265.8312 291.7521 338.4947 360.0635 392.7483 404.4605 417.5231 430.4526 473.6734 499.0373 582.0377 592.6012 615.8354 681.6406 692.7845 706.6116 747.7547 790.7552 857.3297 862.4761 896.0707 904.6126 927.3470 935.7724 942.2607 983.6901 989.6474 1003.7910 1011.9008 1014.4230 1030.9307 1045.2120 1084.1864 1173.1639 1176.9655 1189.2952 1217.3770 1238.1097 1255.6869 1260.9396 1315.7164 1367.6561 1371.9896 1382.9682 1393.8330 1417.6390 1434.4352 1450.7789 1460.1517 1466.6574 1473.0317 1476.3584 1486.7740 1492.5440 1514.4612 1583.5285 1609.6543 1626.6850 2963.3283 2973.4938 2987.5153 3056.0997 3064.9181 3070.7016 3079.7107 3098.2878 3107.1797 3121.0355 3131.5640 3144.0690 3156.6249 3168.5421 3408.6860 3425.0545
redmass: 3.1257 4.5076 3.3226 5.4012 3.5451 3.6785 1.1158 1.8823 1.1830 1.2634 2.7812 5.0113 2.4341 2.5222 4.2709 2.8204 2.0004 2.0036 3.3010 3.0359 1.2942 3.5368 5.4923 5.7673 4.3128 1.5531 3.2613 2.3606 1.5241 3.2711 1.9680 1.9509 1.5138 1.4634 1.2200 1.4543 4.9558 1.3396 1.4245 3.6036 1.5041 2.2709 1.6219 1.0737 2.6984 1.2124 2.9275 2.9736 3.1424 2.7983 1.3277 1.2113 1.2265 9.1423 1.2069 1.2924 2.0309 1.0544 1.0554 1.0486 1.1312 1.7976 1.1152 1.0839 1.4398 6.2032 6.0564 8.0434 1.0355 1.0383 1.0360 1.0996 1.0969 1.0981 1.0984 1.1006 1.1000 1.0861 1.0875 1.0924 1.0957 1.1008 1.0761 1.0755
irintensity: 0.0320 1.7754 1.0408 3.2516 5.0096 2.9056 0.3194 1.0623 0.2650 0.3941 3.2056 3.2537 1.9025 4.1623 4.9542 0.3672 32.9433 30.8708 3.7373 52.0631 91.7135 17.2337 5.7946 5.2968 5.4843 94.5470 14.8838 21.3278 2.8330 19.9859 0.7591 1.0290 4.2991 4.0384 0.3212 1.7794 0.0115 0.5285 1.5844 34.2950 0.6885 14.7770 9.7564 0.9229 2.0981 13.0751 126.2932 25.8920 50.7918 61.6510 0.2144 33.8680 23.3727 0.6314 12.7939 28.0415 13.7178 4.3716 3.6744 3.1324 12.1056 15.2147 28.3413 26.3464 56.5409 22.5089 5.9745 129.0738 26.3576 36.6279 15.2798 35.8556 7.3097 41.6547 73.6062 15.0111 29.1202 7.0063 3.2566 24.1594 18.1535 20.6147 35.7643 2.1956
temp: 298.150 k
press: 1.00000 atm
elementType: 8 7 7 6 6 6 6 6 6 6 6 6 6 6 1 1 1 1 1 1 1 1 1 1 1 1 1 1 1 1
symmnumber: 1
zpe: 657988.0 jmol-1
zpe.correction: 0.250614 hartree
zpe.thermalcorrener: 0.265266 hartree
zpe.thermalcorrenthalpy: 0.266210 hartree
zpe.thermalcorrgfe: 0.208602 hartree
zpe.sumelectzpe: -612.415703 hartree
zpe.sumelectthermal: -612.401051 hartree
zpe.sumelectthermalent: -612.400107 hartree
zpe.sumelectthermalfe: -612.457715 hartree
dipole: 0.2365 4.4010 1.2966
dipole: 4.5941
quadrupole: -69.3234 -85.5417 -86.3927
quadrupole: 1.9011 -2.5697 -7.2555
quadrupole: 11.0959 -5.1224 -5.9734 1.9011 -2.5697 -7.2555
hfenergy: -612.6663171 hartree
pointgroup: C01 [X(C11H16N2O1)]
dipole: -0.0232048 -0.919997 -1.5556174 debye
polarizability: 184.5245548|-18.0914158|90.3859347|2.8794277|1.6359677|133.4638028 unknown
InChI: InChI=1S/C11H16N2O/c1-11(2,3)13-12-10(14)9-7-5-4-6-8-9/h4-8,12-13H,1-3H3
charge 0 multiplicity 1
30 atoms
O  -0.215524 1.140283 1.788782
N  -2.1511 0.778753 -0.266625
N  -0.80417 0.379824 -0.359063
C  -3.180957 -0.303848 -0.114192
C  -3.195514 -1.276019 -1.331456
C  -2.888518 -1.079351 1.190019
C  -4.533616 0.437475 -0.008394
C  0.099681 0.609215 0.687923
C  1.509406 0.14068 0.397814
C  2.058675 0.076647 -0.910348
C  2.321925 -0.20611 1.507508
C  3.391766 -0.350434 -1.103157
C  3.650246 -0.638058 1.313727
C  4.187826 -0.716407 0.00655
H  -2.218177 -1.782093 -1.453771
H  -3.954695 -2.067353 -1.192775
H  -3.433184 -0.736855 -2.268722
H  -2.806604 -0.375798 2.034979
H  -1.935971 -1.635265 1.118668
H  -3.695139 -1.80703 1.392303
H  -4.741282 1.032236 -0.920026
H  -5.360184 -0.284016 0.11663
H  -4.523703 1.12143 0.857396
H  -2.389885 1.471123 -0.990113
H  -0.499529 -0.22156 -1.135699
H  1.471659 0.400529 -1.778228
H  1.891647 -0.116423 2.510459
H  3.812088 -0.385481 -2.114418
H  4.267887 -0.908613 2.177185
H  5.221347 -1.047382 -0.144853
