program: Gaussian 09
title: 000299461
version: EM64L-G09RevD.01
frameworkgroup: C1[X(C20H15FO3)]
method: RPBEPBE
basis: SDD
operation: Freq
keyword: #p
keyword: freq=noraman
keyword: PBEPBE/SDD
title: #p freq=noraman PBEPBE/SDD
converged: YES YES NO NO
title: Mulliken charges:
elementType: F O O O C C C C C C C C C C C C C C C C C C C C H H H H H H H H H H H H H H H
charge: -0.188795 -0.199906 -0.428931 -0.225612 0.266452 0.268198 0.172445 0.302071 -0.587103 -0.007327 0.227117 -0.015023 0.072417 -0.367838 -0.408550 0.312724 -0.377952 -0.789281 -0.254259 -0.235502 -0.430736 -0.223742 -0.805901 0.062483 0.278117 0.278118 0.268574 0.262434 0.243250 0.228950 0.245906 0.232257 0.234545 0.241318 0.236639 0.271881 0.221237 0.234556 0.384768
chargesum: 0.00000
title: Mulliken charges with hydrogens summed into heavy atoms:
elementType: F O O O C C C C C C C C C C C C C C C C C C C C
charge: -0.188795 -0.199906 -0.044163 -0.225612 0.266452 0.268198 0.172445 0.302071 -0.308986 -0.007327 0.227117 -0.015023 0.072417 -0.089720 -0.139976 0.312724 -0.115518 -0.071175 -0.022002 -0.000957 -0.189418 0.012897 -0.078226 0.062483
polarizability: 3.08701515e+02 -7.42538286e+00 2.33552347e+02 7.27570920e+00 -2.11076127e-01 1.66747330e+02
1716.lowfreq: -8.8121 -5.2008 -0.0008 -0.0004 0.0003 5.7757 18.9267 25.4767 26.9855
frequency: 18.7279 25.4533 26.9643 42.5640 68.3992 86.2421 100.5252 121.6366 134.4493 141.2686 153.9272 179.5039 187.3969 216.4194 230.4589 241.6351 253.3382 273.1209 317.1330 318.8722 357.0560 382.7716 403.8457 423.1855 439.8195 455.9620 477.3026 497.1921 517.0996 530.9726 556.3087 572.9160 582.0072 595.6710 628.8156 649.9608 659.3448 685.8072 688.8013 701.7969 739.4772 762.2900 780.5682 780.9917 795.2426 811.0281 824.9726 883.2244 913.8585 920.6608 926.2926 952.7584 970.7364 991.2762 995.7470 998.8239 1006.6525 1011.7508 1032.2387 1047.8095 1049.4825 1073.1776 1084.9154 1103.3411 1155.4058 1164.3895 1180.4785 1182.2066 1220.2569 1247.8768 1260.2681 1265.5434 1295.4926 1308.0221 1367.1062 1370.4306 1375.8005 1402.3818 1406.7656 1413.6206 1420.3984 1431.9851 1449.1546 1454.0566 1462.7715 1463.0395 1474.8701 1480.0436 1511.7007 1538.2558 1576.4131 1583.6456 1592.3609 1606.1314 1634.7758 1652.7836 2990.0213 2991.8609 3068.8766 3074.6740 3099.7426 3101.6660 3130.9366 3135.3981 3146.6118 3148.9319 3152.0321 3165.0484 3170.4591 3178.4578 3521.6660
redmass: 1.0319 5.9781 6.6739 5.4277 5.5840 5.9471 4.7259 2.9693 1.3500 3.7234 7.5852 6.1559 5.9726 3.1535 3.8261 4.1996 4.2950 5.8734 6.0289 9.2196 4.8835 6.5072 4.2429 3.8353 4.9036 3.8113 7.2486 3.3239 3.4873 4.2318 4.6527 3.9112 1.5853 6.5420 4.3402 4.9871 3.8827 4.3211 6.4113 6.1680 3.7276 5.6289 1.6895 1.6987 3.1752 3.3342 3.4709 1.5980 2.0644 1.7476 1.7310 4.2158 1.3934 1.4118 2.1528 1.7645 2.0893 1.9075 2.2177 1.5264 1.5723 3.0057 2.4225 3.2229 1.8821 1.6415 1.1797 1.1809 1.8662 1.7663 2.5344 1.9422 2.5036 3.1861 6.9523 2.6726 5.3319 1.3655 1.2317 4.4719 2.9977 2.5555 2.6512 2.6827 1.0628 1.0456 1.2463 1.1799 3.1411 11.1785 7.4079 7.2581 5.9740 6.1131 7.4560 9.1508 1.0372 1.0377 1.0974 1.0959 1.1005 1.0996 1.0869 1.0863 1.0916 1.0917 1.0905 1.0992 1.0956 1.0981 1.0640
irintensity: 0.3824 0.3666 0.2938 0.6432 0.8162 0.8908 2.8075 1.1917 0.3641 0.2739 3.4326 4.4389 0.8475 1.8443 1.5202 5.9280 1.6539 3.8024 4.2186 1.9991 1.5230 1.3720 3.5048 3.8291 3.8183 2.7600 5.2345 0.1077 20.9189 4.2632 10.6356 4.4012 70.6584 12.0115 34.7820 10.7540 7.6338 53.3766 16.0534 5.9280 9.4628 1.3552 39.3387 67.0491 10.4314 16.3725 28.4491 0.5429 5.7690 8.5720 7.3826 5.2733 0.4436 16.7829 97.9395 58.4544 3.9864 1.5588 11.3431 6.3269 10.7090 21.0507 9.5278 133.9558 46.0891 13.8110 7.6130 2.6231 3.8920 53.5935 3.6240 100.8153 67.7223 130.2967 10.1774 15.1017 57.1682 7.5888 20.6742 4.4669 5.6634 58.8611 11.9302 5.2362 14.5834 14.3286 1.7337 6.9156 65.1496 164.6748 42.6632 10.5750 7.2747 5.0002 1.2519 273.9721 26.2034 18.8293 12.5339 12.8379 15.3357 12.1868 4.1632 5.0230 15.9036 1.4985 11.2849 15.8853 10.5773 13.0649 35.0681
temp: 298.150 k
press: 1.00000 atm
elementType: 9 8 8 8 6 6 6 6 6 6 6 6 6 6 6 6 6 6 6 6 6 6 6 6 1 1 1 1 1 1 1 1 1 1 1 1 1 1 1
symmnumber: 1
zpe: 768162.9 jmol-1
zpe.correction: 0.292578 hartree
zpe.thermalcorrener: 0.313985 hartree
zpe.thermalcorrenthalpy: 0.314930 hartree
zpe.thermalcorrgfe: 0.240247 hartree
zpe.sumelectzpe: -1095.006795 hartree
zpe.sumelectthermal: -1094.985387 hartree
zpe.sumelectthermalent: -1094.984443 hartree
zpe.sumelectthermalfe: -1095.059126 hartree
dipole: 0.6340 3.3478 1.7253
dipole: 3.8192
quadrupole: -137.5644 -134.7066 -128.6626
quadrupole: -14.8191 -4.5322 -3.4931
quadrupole: -3.9199 -1.0620 4.9819 -14.8191 -4.5322 -3.4931
hfenergy: -1095.2993729 hartree
pointgroup: C01 [X(C20H15F1O3)]
dipole: 0.3143523 0.3716737 1.4215593 debye
polarizability: 306.4104916|-18.1969358|199.9320239|-0.4226871|33.6962369|202.6586762 unknown
InChI: InChI=1S/C20H15FO3/c1-11-6-5-9-15(17(11)20(23)24)19(22)16-10-12(2)18(21)14-8-4-3-7-13(14)16/h3-10,23H,1-2H3
charge 0 multiplicity 1
39 atoms
F  5.042949 -0.710997 0.089086
O  -0.987745 -1.129183 -2.066633
O  -2.154002 1.539545 -1.697241
O  -4.19298 0.48743 -2.0684
C  0.889552 -0.641422 -0.637785
C  1.472536 0.412506 0.164743
C  2.901731 0.378616 0.413398
C  3.123045 -1.681187 -0.990524
C  1.714363 -1.624278 -1.211617
C  -0.580859 -0.762068 -0.921614
C  -1.580857 -0.585474 0.19679
C  3.653104 -0.683604 -0.171553
C  -2.876415 -0.042286 -0.055215
C  0.730889 1.529698 0.676855
C  3.523308 1.401653 1.200792
C  -3.89081 -0.084691 0.944913
C  -1.287019 -1.140077 1.465382
C  3.992195 -2.762936 -1.595657
C  1.358916 2.520738 1.434837
C  2.760054 2.4516 1.71221
C  -3.56648 -0.662802 2.200198
C  -2.280977 -1.179238 2.464889
C  -5.281746 0.47764 0.71352
C  -3.168127 0.623487 -1.365255
H  1.246335 -2.385471 -1.844998
H  -0.332643 1.62019 0.442493
H  4.601138 1.349102 1.379537
H  -0.293635 -1.558999 1.653842
H  4.492067 -3.362881 -0.813523
H  3.391305 -3.442268 -2.221871
H  4.791659 -2.329323 -2.223209
H  0.774733 3.366873 1.812261
H  3.235132 3.235146 2.311962
H  -4.337395 -0.697922 2.978414
H  -2.057507 -1.617868 3.443202
H  -5.79109 -0.054535 -0.108024
H  -5.892402 0.391269 1.627535
H  -5.251681 1.543161 0.419975
H  -2.327644 1.905855 -2.60621
