program: Gaussian 09
title: 000299437
version: EM64L-G09RevD.01
frameworkgroup: C1[X(C16H24N2O2S)]
method: RPBEPBE
basis: SDD
operation: Freq
keyword: #p
keyword: freq=noraman
keyword: PBEPBE/SDD
title: #p freq=noraman PBEPBE/SDD
converged: YES YES NO NO
title: Mulliken charges:
elementType: S O O N N C C C C C C C C C C C C C C C C H H H H H H H H H H H H H H H H H H H H H H H H
charge: 0.863179 -0.551577 -0.543563 -0.016752 -0.056291 -0.111930 -0.414738 -0.420119 -0.412500 -0.404767 -0.395090 -0.019714 0.185733 -0.239644 -0.260597 -0.702456 -0.694359 -0.677497 -0.210468 -0.217946 -0.220649 0.256680 0.254071 0.229621 0.239106 0.220951 0.211943 0.211834 0.210597 0.198339 0.210265 0.269175 0.292032 0.221048 0.208115 0.226554 0.233332 0.217338 0.210834 0.253935 0.201422 0.228943 0.239838 0.239814 0.235958
chargesum: 0.00000
title: Mulliken charges with hydrogens summed into heavy atoms:
elementType: S O O N N C C C C C C C C C C C C C C C C
charge: 0.863179 -0.551577 -0.543563 -0.016752 -0.056291 -0.111930 0.096014 0.048608 0.020394 0.017664 0.013514 -0.019714 0.185733 0.029531 0.031435 -0.046739 -0.032855 0.006803 0.029370 0.021868 0.015309
polarizability: 2.75803093e+02 -7.44847270e+00 2.34883297e+02 1.23697219e+01 6.76012341e+00 1.73739482e+02
1716.lowfreq: -10.9639 -7.3118 -0.0015 -0.0014 -0.0004 7.4503 12.9921 28.3718 39.7510
frequency: 12.9757 28.3145 39.6512 45.1804 52.2808 78.5836 91.8277 103.8363 134.0461 142.7782 161.2529 165.1818 188.3230 192.7270 216.7293 227.4375 234.3135 240.2502 247.9810 280.5236 308.8765 320.1302 333.5675 345.6179 372.4535 378.8459 403.4824 412.7829 416.3141 443.6554 457.6556 495.1681 504.8585 533.3312 541.1254 603.5725 656.1880 667.4425 691.1873 731.3195 759.1543 779.3074 787.1588 792.4662 832.3712 848.4164 849.9426 875.1613 906.1253 914.3677 919.9371 922.9042 926.8367 932.0707 951.5671 953.3639 978.5187 981.6008 1001.0893 1003.4586 1008.1200 1012.7858 1032.4502 1040.3282 1047.4182 1074.0697 1088.7175 1096.7499 1129.6473 1154.0772 1172.1966 1174.9884 1195.3646 1216.9489 1235.7942 1241.5354 1256.6034 1280.8806 1291.5619 1299.7299 1308.1060 1315.9795 1334.3738 1343.4451 1357.5066 1369.7296 1372.1666 1382.7745 1391.0152 1414.4974 1434.7144 1442.6208 1444.6169 1450.9655 1453.6127 1456.4446 1461.2487 1464.3253 1466.2970 1468.2594 1470.0755 1474.5307 1492.3702 1577.5304 1602.1750 2973.9923 2981.6457 2984.1170 2986.3657 2987.7074 2988.7230 2992.0943 2997.1368 3035.6132 3044.9298 3054.5789 3067.2922 3081.0664 3082.6690 3087.3956 3090.5217 3093.7159 3097.5137 3099.2289 3134.6937 3145.7471 3155.6943 3165.4613 3174.4322
redmass: 4.7474 2.8086 4.0754 4.6967 4.7720 4.3213 3.5849 2.7487 4.2412 6.1656 1.6319 1.8450 3.8046 9.0789 2.9356 1.2002 1.4570 1.4399 6.0865 4.2690 2.9405 2.1530 2.4141 5.1643 2.4714 8.3929 2.8050 3.3247 2.5503 6.6760 2.6183 2.3207 4.3744 2.8235 4.0751 6.4753 7.0445 3.3166 2.2838 4.4429 1.4705 1.4893 3.0255 12.9401 2.9384 1.6761 1.2998 2.7152 3.8575 5.1774 1.5753 1.6162 1.4719 1.3677 1.2159 2.8420 4.5583 1.5009 1.8613 1.3633 4.0497 1.5053 1.6768 1.9072 2.1206 1.5389 1.2104 1.8461 1.4129 2.2968 1.0579 1.1257 2.3251 2.8561 1.9329 1.3415 2.3464 1.4880 1.5335 1.3099 1.4095 1.2933 1.4960 1.4847 1.4570 1.1885 1.2261 8.4274 1.5395 3.3984 2.2177 1.0998 1.0522 2.0173 1.1041 1.0478 1.0880 1.0537 1.0830 1.0529 1.0656 1.0918 1.0578 5.8538 6.9382 1.0620 1.0622 1.0345 1.0345 1.0611 1.0616 1.0356 1.0625 1.0971 1.1011 1.1024 1.1020 1.0992 1.1004 1.1003 1.1004 1.1000 1.0991 1.1000 1.0856 1.0887 1.0930 1.0966 1.1006
irintensity: 1.1388 0.3294 0.1865 0.8474 2.2692 1.2011 0.0559 0.9394 3.0132 0.5808 1.5560 1.7530 10.9589 3.6830 1.8717 0.1934 0.1348 0.1845 7.5908 0.7087 0.1355 0.4638 0.5582 0.8851 6.2030 14.5851 0.0850 7.6073 1.7457 47.6826 2.9787 9.4326 84.9785 1.0269 3.8915 0.0384 4.8356 16.0626 31.9838 0.4206 72.4863 1.8150 2.5115 56.4834 2.3976 20.2631 0.8595 4.7081 18.9630 35.1197 1.8298 2.0722 5.1578 1.1764 0.0861 7.3814 4.0771 1.0044 36.8617 1.6418 1.8352 10.8482 0.1077 25.1062 22.7200 5.5377 0.1461 0.0690 8.6715 0.1073 0.0538 10.4260 25.6008 33.8826 2.7151 17.2124 7.8189 16.2499 7.2342 3.0151 9.2228 19.0031 0.9877 2.2233 6.8927 19.1780 24.3411 4.4054 8.4105 14.6745 13.9205 13.6917 0.4098 12.0921 15.4069 1.1958 8.3819 3.5284 17.1937 10.8043 10.2530 5.9065 23.5409 4.1962 0.4822 37.4422 27.5580 24.0380 23.5753 14.0559 26.5623 26.3905 0.9917 58.8172 36.6953 43.5008 18.9184 5.0956 5.7509 20.4960 11.8035 24.8513 58.3351 29.8743 0.9642 9.1616 3.1775 11.8708 26.0993
temp: 298.150 k
press: 1.00000 atm
elementType: 16 8 8 7 7 6 6 6 6 6 6 6 6 6 6 6 6 6 6 6 6 1 1 1 1 1 1 1 1 1 1 1 1 1 1 1 1 1 1 1 1 1 1 1 1
symmnumber: 1
zpe: 973277.4 jmol-1
zpe.correction: 0.370702 hartree
zpe.thermalcorrener: 0.393697 hartree
zpe.thermalcorrenthalpy: 0.394641 hartree
zpe.thermalcorrgfe: 0.317183 hartree
zpe.sumelectzpe: -1280.310963 hartree
zpe.sumelectthermal: -1280.287967 hartree
zpe.sumelectthermalent: -1280.287023 hartree
zpe.sumelectthermalfe: -1280.364482 hartree
dipole: 0.2393 -0.6934 -5.7773
dipole: 5.8237
quadrupole: -117.3153 -124.1909 -147.7430
quadrupole: 2.3569 9.3301 -1.4138
quadrupole: 12.4345 5.5588 -17.9933 2.3569 9.3301 -1.4138
hfenergy: -1280.6816645 hartree
pointgroup: C01 [X(C16H24N2O2S1)]
dipole: 0.3120486 0.2090134 2.2602247 debye
polarizability: 268.7841797|13.995276|237.3838003|-23.5327004|5.4819485|178.2578922 unknown
InChI: InChI=1S/C16H24N2O2S/c1-15(2,3)17-18-16(12-8-5-9-13-16)21(19,20)14-10-6-4-7-11-14/h4,6-7,10-11H,5,8-9,12-13H2,1-3H3
charge 0 multiplicity 1
45 atoms
S  -0.977819 -0.487764 -1.241752
O  -1.40468 -1.911258 -1.94055
O  -0.713862 0.852895 -2.146352
N  1.100078 0.428413 0.334322
N  2.056418 1.014164 -0.314097
C  0.806023 -0.923269 -0.147717
C  1.700009 -1.58548 -1.188757
C  0.353298 -1.836748 0.983144
C  2.934399 -2.217714 -0.482935
C  1.600749 -2.456755 1.678611
C  2.512969 -3.174159 0.656695
C  -2.340838 -0.077284 0.009453
C  2.287315 2.45896 0.060799
C  -2.45813 1.248871 0.456287
C  -3.208457 -1.112444 0.393981
C  1.46032 2.960406 1.261841
C  3.808862 2.570562 0.335106
C  1.91759 3.22907 -1.241132
C  -3.504303 1.546215 1.360448
C  -4.249034 -0.795605 1.298602
C  -4.390796 0.526581 1.78265
H  2.029183 -0.840947 -1.933456
H  1.116743 -2.372178 -1.705442
H  -0.268395 -2.652799 0.565113
H  -0.250155 -1.268164 1.713089
H  3.571856 -1.40773 -0.078243
H  3.53528 -2.757858 -1.238321
H  1.260692 -3.158952 2.462952
H  2.1705 -1.652773 2.185899
H  1.971239 -4.04179 0.227393
H  3.409953 -3.574564 1.16668
H  -1.773397 2.019804 0.090384
H  -3.087755 -2.115995 -0.027383
H  1.664496 2.361462 2.166803
H  1.719776 4.014551 1.468135
H  0.377935 2.895379 1.059285
H  4.383999 2.125257 -0.495212
H  4.083062 2.048448 1.269743
H  4.094871 3.633045 0.432768
H  0.858927 3.061895 -1.505366
H  2.0926 4.309587 -1.088475
H  2.536122 2.883371 -2.087038
H  -3.628647 2.570162 1.728276
H  -4.948063 -1.576402 1.616249
H  -5.200234 0.765637 2.48112
