program: Gaussian 09
title: 000299399
version: EM64L-G09RevD.01
frameworkgroup: C1[X(C10H11BrN2O)]
method: RPBEPBE
basis: SDD
operation: Freq
keyword: #p
keyword: freq=noraman
keyword: PBEPBE/SDD
title: #p freq=noraman PBEPBE/SDD
converged: YES YES NO NO
title: Mulliken charges:
elementType: Br O N N C C C C C C C C C C H H H H H H H H H H H
charge: -0.002127 -0.293648 -0.492088 -0.416975 0.478987 -0.425916 -0.447473 -0.341950 0.323925 -0.197656 -0.212923 -0.259453 0.065575 -0.563589 0.288926 0.235551 0.287688 0.213281 0.306820 0.294050 0.224320 0.225112 0.227691 0.248316 0.233557
chargesum: 0.00000
title: Mulliken charges with hydrogens summed into heavy atoms:
elementType: Br O N N C C C C C C C C C C
charge: -0.002127 -0.293648 -0.203162 -0.122925 0.478987 0.097323 -0.234192 -0.035130 0.323925 0.026664 0.012189 -0.031762 0.065575 -0.081716
polarizability: 2.14067997e+02 3.19521995e+01 1.06347750e+02 1.57905934e+01 -2.57266849e+00 1.15839688e+02
1716.lowfreq: -13.4683 -5.6613 0.0005 0.0006 0.0007 3.3991 18.4465 26.8534 52.7737
frequency: 18.4040 26.8069 52.6995 58.3985 80.0739 138.8541 179.7361 230.5187 260.5833 285.8375 333.2064 337.8202 364.4620 400.6456 407.9953 506.5153 510.5472 544.7509 590.2282 606.2703 618.5504 679.7846 695.8310 704.9721 725.3850 764.8453 831.2554 838.7708 908.7136 912.7942 927.3897 944.6988 969.2115 984.0226 998.5128 1017.9207 1027.5741 1089.3726 1116.1073 1149.8277 1171.8843 1189.7465 1207.0439 1235.2620 1266.5005 1321.2316 1335.6487 1384.4803 1408.4830 1427.9136 1458.8779 1478.5487 1488.5246 1518.1854 1600.6373 1616.4308 1642.3355 1644.5725 2969.6079 3042.9995 3101.3085 3106.1182 3131.1203 3142.8072 3164.7147 3194.7425 3221.8850 3525.5841 3554.0864
redmass: 5.7098 6.3931 4.3017 7.4305 5.6436 3.9568 4.5965 2.9171 4.3319 3.7395 2.4195 5.3422 4.5334 1.7077 2.9173 3.2447 2.8348 5.1351 1.2409 4.9472 5.0800 1.1087 1.9908 10.6582 5.4872 1.6997 5.2403 1.2772 1.7451 1.4297 1.3530 3.2678 1.3473 6.0314 1.3021 2.6852 2.2021 1.5948 3.3625 2.7032 1.0509 1.1126 1.8985 1.2017 2.2038 1.4307 1.2764 5.7260 1.1723 2.3300 1.0760 1.8389 2.3487 2.2439 5.6665 5.7753 5.3714 4.7025 1.0635 1.0962 1.0644 1.0884 1.0866 1.0933 1.0998 1.0949 1.1128 1.0761 1.0775
irintensity: 0.2831 0.7913 2.2774 2.3571 7.6494 1.8559 3.3791 0.4794 9.1136 6.7425 4.1344 0.9360 13.8991 27.8221 0.2289 2.1092 84.6545 22.1261 124.4869 2.5414 1.7143 0.9115 50.1417 11.9076 1.5670 96.4141 2.1847 0.1405 5.3966 13.6117 72.4850 6.4718 0.1220 1.0132 3.1034 1.3165 8.4178 16.0529 24.3626 45.3888 0.5700 4.8297 329.9878 157.5393 17.9663 45.6748 22.5350 72.6131 17.8807 50.0209 21.9360 341.3205 8.0099 601.9203 51.2738 69.6233 47.0976 160.3920 59.9364 12.4377 2.4405 18.7806 0.3992 33.3614 25.4562 7.8747 4.2288 6.5217 20.7577
temp: 298.150 k
press: 1.00000 atm
elementType: 35 8 7 7 6 6 6 6 6 6 6 6 6 6 1 1 1 1 1 1 1 1 1 1 1
symmnumber: 1
zpe: 504771.3 jmol-1
zpe.correction: 0.192257 hartree
zpe.thermalcorrener: 0.206073 hartree
zpe.thermalcorrenthalpy: 0.207017 hartree
zpe.thermalcorrgfe: 0.148137 hartree
zpe.sumelectzpe: -584.827715 hartree
zpe.sumelectthermal: -584.813899 hartree
zpe.sumelectthermalent: -584.812955 hartree
zpe.sumelectthermalfe: -584.871836 hartree
dipole: 1.1686 1.0132 4.3411
dipole: 4.6084
quadrupole: -82.1996 -92.9924 -86.5558
quadrupole: 10.0932 2.1524 1.8466
quadrupole: 5.0497 -5.7432 0.6935 10.0932 2.1524 1.8466
hfenergy: -585.0199721 hartree
pointgroup: C01 [X(C10H11Br1N2O1)]
dipole: 0.7005093 1.5606766 -0.6006718 debye
dipolederiv: -0.1374777 -0.0275469 0.138877 -0.0533163 -0.0399087 -0.0075967 0.1009161 0.0309254 -0.6366582 -0.87333 -0.0374173 -0.0226325 0.1333019 -0.9521369 -0.0798721 0.0566523 -0.0449717 -0.3585151 -2.1359212 0.2890915 0.0554598 0.7291971 -0.4082264 -0.0107227 0.1962974 -0.0097549 -0.3376418 -1.8740977 -0.0845529 -0.096643 -0.2070684 -0.3066296 -0.0010071 -0.0272028 -0.0089281 -0.5137053 1.604948 -0.0425755 -0.0582651 0.2811903 0.0032941 -0.0179084 -0.0828372 -0.0065809 0.1103727 0.6853463 -0.158525 0.165593 -0.6425922 0.1786654 -0.0273403 -0.031349 0.0181313 0.0712746 -0.3697308 0.0098009 -0.0033102 0.2287925 0.0324802 0.0079576 0.0339306 0.0248624 -0.2209015 -0.368435 0.0078694 0.0033539 -0.2909447 -0.055585 0.0215901 -0.0141935 0.0053309 -0.1678222 2.8481595 -0.0434742 -0.0302102 -0.4988108 1.3142752 0.1456822 -0.3306205 0.0751481 0.304559 0.1224652 0.0176255 -0.0165253 -0.0790315 0.1270484 0.0297915 -0.027539 0.0222426 -0.1353445 0.1461102 0.000046 -0.0179468 0.0858387 0.1613296 0.0235893 -0.016964 0.026042 -0.1382724 -0.0738964 0.0316568 -0.0142939 0.0350771 -0.1725381 -0.0001201 -0.0068962 0.0000756 -0.1937428 0.3455545 0.1854534 -0.3314719 0.3029241 -0.1493913 -0.0431138 -0.1425886 -0.0582063 1.0693647 -0.4513141 0.0126731 0.1019916 -0.0385985 -0.3422541 0.0290798 0.0937714 0.0484798 -0.220108 0.1200482 -0.0050323 0.0167799 -0.0416975 0.0789257 -0.024604 0.0244382 -0.027634 0.2951517 -0.1472306 0.0293054 0.0361422 0.0510068 0.104475 0.0235822 0.1013241 -0.014874 -0.1411737 0.1897508 -0.0698105 0.0086387 0.0838967 0.0447903 0.0343051 -0.022134 0.0264319 0.1133765 0.0146191 -0.1229223 0.0014751 -0.0987042 -0.0767928 -0.0148225 0.0040097 -0.0132506 0.1645295 0.1857611 0.0479122 0.0109477 0.0453317 0.0607922 -0.0102012 0.008017 -0.012261 0.176524 0.1237417 0.0188802 0.0216575 0.05789 0.0658174 -0.0141087 0.0751134 -0.0162633 0.3416091 0.0032116 0.0969504 0.0178706 0.1173236 -0.0597376 -0.0265616 0.0215509 -0.0267221 0.1526557 0.0357767 -0.0720734 0.0005707 -0.1004901 -0.0844891 -0.0151267 0.0000562 -0.0153983 0.1495509 -0.1429749 -0.0202338 0.0192415 -0.0205424 0.0875588 -0.0057539 0.0225168 -0.0061277 0.1686528 0.040815 -0.0347306 -0.0704811 -0.0508543 0.1901384 -0.0114836 -0.0703447 -0.0218457 0.0277239 0.1081006 -0.02837 0.0631808 -0.0291197 0.198099 -0.0052343 0.0340753 0.0051486 -0.0814593 unknown
polarizability: 223.6666207|1.443715|115.6201477|-11.8746604|3.4432478|96.9686675 unknown
InChI: InChI=1S/C10H11BrN2O/c1-8(11)7-12-10(14)13-9-5-3-2-4-6-9/h2-6,12-13H,1,7H2
charge 0 multiplicity 1
25 atoms
Br 3.493781 -0.464427 2.356492
O  0.358314 -1.686687 -0.410996
N  -0.466934 0.518846 -0.180408
N  1.827112 0.129086 -0.442308
C  -1.871153 0.298388 -0.096945
C  3.010404 -0.725415 -0.5365
C  -2.697114 1.44462 0.066022
C  -2.465518 -0.990249 -0.167155
C  0.546886 -0.435159 -0.346636
C  -4.096703 1.307906 0.157534
C  -3.869249 -1.108053 -0.075227
C  -4.694781 0.028136 0.086781
C  4.088997 -0.382736 0.472324
C  5.372283 -0.067161 0.187278
H  -0.17981 1.495284 -0.084879
H  3.468734 -0.668144 -1.545268
H  2.647949 -1.760934 -0.393355
H  -2.242896 2.443193 0.121937
H  -1.827459 -1.867494 -0.286228
H  1.964894 1.140212 -0.420583
H  -4.718363 2.201324 0.283877
H  -4.319734 -2.105686 -0.129583
H  -5.782189 -0.079823 0.157889
H  6.118792 0.130336 0.960093
H  5.696256 -0.011364 -0.859655
