program: Gaussian 09
title: 000299381
version: EM64L-G09RevD.01
frameworkgroup: C1[X(C11H7Cl2NO2)]
method: RPBEPBE
basis: SDD
operation: Freq
keyword: #p
keyword: freq=noraman
keyword: PBEPBE/SDD
title: #p freq=noraman PBEPBE/SDD
converged: YES YES NO NO
title: Mulliken charges:
elementType: Cl Cl O O N C C C C C C C C C C C H H H H H H H
charge: -0.009081 0.014033 -0.201823 -0.187709 -0.216140 0.184266 0.183416 0.123038 0.102423 -0.447374 -0.350059 -0.348174 -0.208554 -0.208758 0.212434 -0.475813 0.273413 0.254526 0.270840 0.271323 0.240934 0.241066 0.281773
chargesum: 0.00000
title: Mulliken charges with hydrogens summed into heavy atoms:
elementType: Cl Cl O O N C C C C C C C C C C C
charge: -0.009081 0.014033 -0.201823 -0.187709 -0.216140 0.184266 0.183416 0.123038 0.102423 0.080565 -0.079219 -0.076850 0.032380 0.032308 0.212434 -0.194040
polarizability: 1.95027412e+02 1.31007295e+01 1.55674045e+02 -1.93299524e+01 -3.03695824e+00 9.07845111e+01
1716.lowfreq: -6.3201 -2.1393 -0.0023 -0.0017 -0.0007 5.1646 19.9339 36.8278 41.6051
frequency: 19.8902 36.8075 41.5583 106.9190 139.7644 154.2116 172.4382 175.7051 212.8691 240.1830 281.9285 326.9532 338.3673 410.0902 427.4074 455.1558 482.3333 522.9136 564.7300 583.9126 627.8801 659.1754 679.5545 697.9106 723.2874 772.7557 781.2969 786.9658 798.9828 835.2382 908.5062 938.3242 951.8839 976.6546 1008.1728 1015.2786 1069.8680 1076.7906 1101.9147 1168.8580 1171.7234 1204.6616 1243.7898 1284.1787 1311.0601 1322.9842 1369.6490 1416.3599 1435.1345 1453.9348 1454.3079 1614.0715 1618.3290 1632.1689 1648.3463 1679.9113 3015.6205 3079.5460 3141.5186 3154.7290 3166.1460 3176.0992 3194.5536
redmass: 14.9617 9.6062 8.5373 10.6962 5.1868 15.3865 8.1582 8.7360 6.6321 7.3579 9.1268 2.4645 5.9030 3.1793 4.9798 4.8595 6.8640 7.2182 8.9706 9.0551 6.3416 4.8291 6.1785 5.2525 2.9050 4.2151 1.4350 4.8637 1.7683 5.1533 1.3942 3.8132 5.2346 1.4120 1.3485 2.0495 2.7937 3.4938 2.9700 1.2010 1.9989 3.0082 1.2229 1.4859 1.5592 2.4572 1.6224 6.0269 1.1084 2.6652 2.5167 7.6635 7.8044 11.9581 8.3863 12.0473 1.0585 1.1043 1.0865 1.0906 1.0957 1.1004 1.0939
irintensity: 0.4092 1.5017 0.0356 4.4931 0.0174 1.1269 1.1773 1.5175 0.3565 0.3807 5.3050 4.3283 10.1136 3.4127 2.4301 0.0185 31.3570 7.4047 10.6389 19.9868 24.4185 0.0890 1.3843 13.5621 95.9601 38.8140 22.0269 0.7767 27.3089 2.8282 0.0069 60.7799 51.4180 2.0093 0.0023 1.3900 38.7309 9.1712 2.2350 6.9178 3.7637 12.3178 2.5644 0.3621 114.9596 250.9781 90.8037 6.9655 56.3801 3.8917 10.2451 1.5614 60.8154 352.7025 44.8135 56.2374 16.3910 1.3072 1.6395 4.5238 4.9576 19.8736 12.3064
temp: 298.150 k
press: 1.00000 atm
elementType: 17 17 8 8 7 6 6 6 6 6 6 6 6 6 6 6 1 1 1 1 1 1 1
symmnumber: 1
zpe: 407102.7 jmol-1
zpe.correction: 0.155057 hartree
zpe.thermalcorrener: 0.169109 hartree
zpe.thermalcorrenthalpy: 0.170054 hartree
zpe.thermalcorrgfe: 0.111463 hartree
zpe.sumelectzpe: -1547.572087 hartree
zpe.sumelectthermal: -1547.558034 hartree
zpe.sumelectthermalent: -1547.557090 hartree
zpe.sumelectthermalfe: -1547.615681 hartree
dipole: 4.0693 -1.2070 0.6601
dipole: 4.2955
quadrupole: -89.7625 -113.3765 -102.4384
quadrupole: -2.8632 -10.9072 0.2529
quadrupole: 12.0966 -11.5174 -0.5792 -2.8632 -10.9072 0.2529
hfenergy: -1547.7271438 hartree
pointgroup: C01 [X(C11H7Cl2N1O2)]
dipole: 1.6112047 0.3639072 -0.3572821 debye
dipolederiv: -0.0895732 0.0004805 0.0505534 0.0617556 -0.3375302 0.2178183 0.0495126 0.2911236 -0.3021166 -0.4713344 0.2133971 0.2312704 0.1451674 -0.1008035 -0.0348839 0.4736101 -0.1962594 -0.2683492 -0.6473538 0.2606254 -0.0624028 0.1197601 -0.9173078 0.0749333 -0.1029495 0.0899992 -0.3455623 -0.5869898 -0.159791 -0.0753858 -0.0321044 -1.0226429 -0.145343 -0.0862353 -0.1384462 -0.3480221 -1.2644935 0.1300749 -0.0772712 -0.0086292 -1.1468859 -0.071955 -0.2223981 -0.0693981 -0.3007585 -0.4648822 0.1497286 -0.0962509 0.1448032 -0.048985 0.0526417 -0.150229 0.0527596 -0.0374468 -0.4075844 -0.1719138 -0.0901339 -0.2015307 -0.1127852 -0.0772156 -0.1356366 -0.0647989 -0.0402652 1.23282 -0.0379994 0.2309015 0.2014769 1.3791293 -0.0373488 0.3215623 0.0212704 0.3119465 1.2766507 -0.1106569 0.2242551 -0.2627394 1.4688284 0.1846623 0.2969714 0.0701284 0.3192033 0.9316388 -0.0259407 -0.014495 0.1297385 0.0052541 0.029681 0.0483668 0.1242837 0.2324442 -0.1015152 -0.105692 -0.0124522 0.0846191 0.1310927 0.0230016 -0.0010581 -0.0197183 -0.0987071 -0.0922722 0.0510446 -0.0049584 -0.1329658 0.1405839 -0.0159884 -0.0134501 0.0259251 -0.0950306 0.0822068 0.121753 0.0879714 0.0830146 -0.0273168 0.0257481 0.0787668 0.0461165 -0.1064589 0.1155734 -0.0897316 0.0879343 -0.0588352 -0.0507081 -0.0074751 0.0826756 -0.0261569 -0.1089129 -0.1824757 -0.009107 -0.0595099 -0.0474188 0.4408353 -0.4074956 -0.0030687 -0.5589195 0.2514615 0.4297876 -0.3070563 -0.4121635 -0.2422911 -0.0085158 0.0970328 -0.6350754 0.3235284 0.2117605 0.0241364 0.053358 0.0468997 -0.0764458 0.0215118 -0.0742985 0.0344682 -0.0259871 0.0995509 -0.0329535 -0.0064821 0.0044478 0.0602191 0.0469361 0.135894 -0.0162838 0.0568664 0.0201668 0.1074305 0.035521 -0.0174422 -0.0070349 -0.0215091 -0.0098182 -0.0163468 0.0024911 0.1517977 0.1092005 -0.0111941 -0.0181912 0.033032 -0.0215833 -0.000481 -0.014037 -0.0118054 0.1519074 -0.0310129 -0.0769814 -0.0621364 -0.0847761 0.0376773 -0.0332149 -0.0665244 -0.0316085 0.1358742 -0.059683 0.0636646 -0.0642939 0.0678966 0.0646052 0.0176905 -0.0679634 0.0166183 0.1373489 0.122679 0.0328989 0.1028536 0.0232885 0.0801196 0.0564146 0.1453223 0.0219875 0.0281682 unknown
polarizability: 194.8756483|-16.895665|158.1715812|10.8124988|0.0171962|88.4387387 unknown
InChI: InChI=1S/C11H7Cl2NO2/c12-5-7(13)6-14-10(15)8-3-1-2-4-9(8)11(14)16/h1-5H,6H2
charge 0 multiplicity 1
23 atoms
Cl -2.931005 -1.372612 1.225196
Cl -4.899757 1.334221 1.291842
O  -0.382015 2.175488 -0.62124
O  0.087488 -2.509431 -0.713484
N  -0.488422 -0.197667 -0.720143
C  1.541475 0.700599 -0.02148
C  1.680157 -0.709493 -0.048416
C  0.154997 1.051173 -0.465429
C  0.388476 -1.309497 -0.512064
C  -1.884227 -0.316264 -1.160088
C  2.601859 1.532744 0.366991
C  2.882787 -1.333912 0.313901
C  3.822186 0.910421 0.738421
C  3.960378 -0.500728 0.712702
C  -2.883364 -0.075761 -0.043338
C  -3.680415 1.013266 0.014129
H  -2.006999 -1.336976 -1.565538
H  -2.065332 0.417047 -1.965874
H  2.484471 2.62072 0.382084
H  2.978305 -2.423826 0.28836
H  4.671637 1.527277 1.050339
H  4.914253 -0.952083 1.005538
H  -3.613231 1.812596 -0.726908
