program: Gaussian 09
title: 000299421
version: EM64L-G09RevD.01
frameworkgroup: C1[X(C12H16F6O3)]
method: RPBEPBE
basis: SDD
operation: Freq
keyword: #p
keyword: freq=noraman
keyword: PBEPBE/SDD
title: #p freq=noraman PBEPBE/SDD
converged: YES YES NO NO
title: Mulliken charges:
elementType: F F F F F F O O O C C C C C C C C C C C C H H H H H H H H H H H H H H H H
charge: -0.127208 -0.133393 -0.136465 -0.129530 -0.138040 -0.129728 -0.275353 -0.172264 -0.203091 -0.217547 0.053834 -0.405106 0.175234 0.362373 0.357821 -0.464205 -0.713634 -0.368719 0.298690 -0.689567 -0.747994 0.291539 0.260223 0.227321 0.232055 0.249617 0.227126 0.237503 0.215910 0.211268 0.231620 0.228499 0.205475 0.208229 0.268599 0.255780 0.253130
chargesum: 0.00000
title: Mulliken charges with hydrogens summed into heavy atoms:
elementType: F F F F F F O O O C C C C C C C C C C C C
charge: -0.127208 -0.133393 -0.136465 -0.129530 -0.138040 -0.129728 -0.275353 -0.172264 -0.203091 0.073992 0.053834 0.082438 0.175234 0.362373 0.357821 0.017467 -0.033094 0.074169 0.298690 -0.047364 0.029515
polarizability: 1.44065352e+02 -5.96397800e+00 1.54065279e+02 -1.87320849e+00 2.40547869e+00 1.22756343e+02
1716.lowfreq: -9.8967 -3.4312 -0.0009 -0.0006 0.0005 0.5134 22.3625 31.2916 41.7031
frequency: 22.2155 31.1714 41.6895 57.5008 68.3023 68.9469 73.5777 88.6944 91.6588 95.7711 110.6308 116.8219 130.9228 155.9993 180.5179 203.0183 207.5762 221.3952 232.7701 257.1633 270.9447 284.0469 296.5279 298.9590 302.2816 331.1174 332.8887 355.0208 425.7661 445.9360 455.6371 464.3523 488.8574 503.5875 536.4286 551.3338 590.8198 632.0880 658.8197 671.9982 693.8367 744.3805 774.5376 808.2889 833.4330 860.6971 883.3471 907.2562 932.3262 964.0957 983.3808 992.1495 1008.6510 1021.2015 1034.9353 1041.3417 1046.9221 1055.5555 1071.5770 1084.7477 1093.5777 1108.3897 1124.3305 1125.8892 1141.3864 1161.7102 1171.3936 1217.2247 1258.7452 1277.3119 1296.8575 1315.8437 1325.3732 1349.9322 1354.6099 1384.5960 1390.2862 1394.7352 1436.2967 1447.6137 1449.7347 1467.2924 1471.7350 1478.5959 1479.0559 1484.5953 1486.9504 1631.6049 1685.2266 2962.9280 2971.6716 2983.6783 3002.7809 3010.4390 3010.8963 3016.7276 3040.4745 3048.5408 3072.0757 3076.0796 3078.2379 3086.9944 3098.9654 3105.8148 3147.2224
redmass: 2.6171 1.9272 2.9467 1.8034 6.5334 3.8645 2.5154 4.1967 5.9819 4.3413 6.4826 5.7361 5.0488 6.6855 6.2842 1.9733 3.3487 3.4265 1.1390 3.3057 13.8759 7.5383 4.0223 11.9135 13.2181 6.8782 2.8599 3.8239 3.4641 8.5276 6.1474 16.1582 17.1537 4.7638 5.6367 3.2253 8.4017 6.3350 6.7217 3.9221 2.9707 1.3188 1.9354 6.2985 2.6846 1.7866 2.3248 2.8011 2.2055 5.5313 2.5951 4.3212 6.4932 6.2807 2.0053 1.8259 2.3342 2.7130 7.5710 3.7988 2.8964 2.3694 2.3882 3.2989 3.7719 4.7848 3.4398 1.3965 1.3030 1.2756 1.2634 1.3987 1.2129 1.4449 1.4956 1.2279 1.2141 1.2032 1.0847 1.0503 1.0533 1.0675 1.0559 1.0594 1.0428 1.0748 1.0452 8.3666 10.2343 1.0593 1.0364 1.0363 1.0655 1.0675 1.0535 1.0898 1.0613 1.0993 1.0994 1.1000 1.1006 1.0982 1.0969 1.1029 1.1015
irintensity: 0.4558 2.1098 2.1781 0.1291 0.1570 0.1510 3.8853 2.2413 0.9186 0.7886 0.6004 0.7288 0.4155 1.7310 4.0345 0.6344 2.4483 2.6705 0.1505 2.8537 0.6892 0.3135 2.9380 0.4636 0.2240 3.2700 1.5322 4.0623 6.8273 6.2384 3.9079 4.6548 0.1088 0.3312 15.0810 5.2546 12.8854 31.0731 7.2817 5.3691 9.7531 10.7188 11.1702 6.0237 20.0314 23.9718 6.9518 76.8449 58.4447 145.7643 26.0428 27.1406 148.5781 14.3393 0.0522 11.1124 10.8055 3.2527 316.9997 70.3436 67.5950 119.3453 4.6156 168.8833 18.2431 43.7561 326.8530 3.6155 5.5659 37.1808 10.1690 16.7977 11.4084 19.0316 7.9167 57.6324 12.3825 13.2685 20.5286 19.9128 26.5755 13.0408 4.1562 15.1540 14.1823 13.2487 13.6765 92.4408 136.0771 13.2882 31.1894 25.4890 19.7452 3.3069 0.9764 1.3025 12.4481 2.8455 14.1855 52.3664 56.8505 33.1869 2.7496 18.0420 5.3097
temp: 298.150 k
press: 1.00000 atm
elementType: 9 9 9 9 9 9 8 8 8 6 6 6 6 6 6 6 6 6 6 6 6 1 1 1 1 1 1 1 1 1 1 1 1 1 1 1 1
symmnumber: 1
zpe: 704725.1 jmol-1
zpe.correction: 0.268416 hartree
zpe.thermalcorrener: 0.292362 hartree
zpe.thermalcorrenthalpy: 0.293306 hartree
zpe.thermalcorrgfe: 0.213500 hartree
zpe.sumelectzpe: -1289.938051 hartree
zpe.sumelectthermal: -1289.914104 hartree
zpe.sumelectthermalent: -1289.913160 hartree
zpe.sumelectthermalfe: -1289.992967 hartree
dipole: -2.5972 2.9641 -1.1141
dipole: 4.0954
quadrupole: -124.3854 -116.5153 -130.7089
quadrupole: -7.9373 1.1225 6.9893
quadrupole: -0.5156 7.3546 -6.8390 -7.9373 1.1225 6.9893
hfenergy: -1290.2064662 hartree
pointgroup: C01 [X(C12H16F6O3)]
dipole: -0.9847946 -1.270161 0.1142851 debye
polarizability: 143.0522318|4.4073254|152.3091623|4.2245532|8.8472666|125.5255803 unknown
InChI: InChI=1S/C12H16F6O3/c1-4-6-9(20)8(5-2)10(11(13,14)15,12(16,17)18)21-7(3)19/h8H,4-6H2,1-3H3
charge 0 multiplicity 1
37 atoms
F  1.937441 -0.381599 2.075657
F  2.648373 -1.53893 0.273694
F  3.044464 0.680792 0.42568
F  1.424283 2.023292 -1.282498
F  -0.141458 0.712887 -2.241507
F  2.012718 0.023807 -2.16719
O  0.177743 -1.31428 -0.57855
O  -2.011698 2.214523 -0.127173
O  -0.148944 -2.285668 1.538306
C  -0.286209 0.76798 0.838357
C  0.712356 -0.027605 -0.072861
C  0.286384 2.096417 1.415733
C  -1.672836 1.037656 0.148408
C  2.080679 -0.31782 0.681266
C  1.013124 0.691913 -1.436273
C  -2.611303 -0.140247 -0.096994
C  -0.423725 2.47248 2.734532
C  -4.072792 0.271603 -0.368835
C  -0.165118 -2.385768 0.300882
C  -4.965191 -0.948545 -0.678386
C  -0.523873 -3.590026 -0.529116
H  -0.481617 0.075192 1.680441
H  0.137378 2.899373 0.675612
H  1.370165 2.017204 1.602625
H  -2.550588 -0.839838 0.761531
H  -2.214549 -0.696913 -0.972014
H  -0.021332 3.42228 3.129134
H  -1.508243 2.612185 2.5798
H  -0.275027 1.695617 3.507723
H  -4.468425 0.819323 0.50756
H  -4.094469 0.987461 -1.210093
H  -6.00924 -0.638394 -0.863593
H  -4.610896 -1.484932 -1.579437
H  -4.973073 -1.668009 0.162454
H  0.374679 -3.952712 -1.058774
H  -1.270472 -3.325391 -1.296742
H  -0.912614 -4.385006 0.122846
