program: Gaussian 09
title: 000299374
version: EM64L-G09RevD.01
frameworkgroup: C1[X(C11H16O4)]
method: RPBEPBE
basis: SDD
operation: Freq
keyword: #pfreq=noraman
keyword: PBEPBE/SDD
title: #p freq=noraman PBEPBE/SDD
converged: YES YES NO NO
title: Mulliken charges:
elementType: O O O O C C C C C C C C C C C H H H H H H H H H H H H H H H H
charge: -0.232961 -0.199766 -0.420352 -0.208510 0.339826 -0.252706 -0.506307 -0.450437 -0.408858 -0.408924 -0.604638 -0.411676 -0.350558 0.201771 0.138751 0.279627 0.220621 0.258072 0.212078 0.232894 0.213888 0.216786 0.194963 0.213612 0.266602 0.280099 0.203042 0.212518 0.195837 0.193495 0.381210
chargesum: 0.00000
title: Mulliken charges with hydrogens summed into heavy atoms:
elementType: O O O O C C C C C C C C C C C
charge: -0.232961 -0.199766 -0.039141 -0.208510 0.339826 0.026921 -0.027614 -0.005466 0.021816 -0.000349 -0.057937 0.003884 0.038774 0.201771 0.138751
polarizability: 1.43178526e+02 5.48746617e+00 1.20474928e+02 -1.99026363e+00 1.14651406e+00 1.05858414e+02
1716.lowfreq: -15.1463 -14.1966 -0.0004 0.0008 0.0009 11.8551 51.5603 53.0647 77.7002
frequency: 51.5374 52.8210 77.6778 84.7773 122.4599 167.1613 183.5780 217.8394 248.1255 253.2678 302.3257 352.2224 360.9132 370.1328 418.1152 438.5556 484.2031 501.1915 508.0883 577.3140 603.9561 649.3213 673.6990 729.4042 733.4415 762.1764 781.7328 813.5781 834.5907 852.0333 867.7836 876.4907 909.7860 947.3345 953.5724 984.5794 1017.9583 1022.0557 1046.3596 1051.9685 1071.6413 1085.6738 1119.8960 1141.5283 1164.5843 1174.4198 1190.0045 1214.5127 1224.4372 1230.6552 1236.6401 1258.8495 1277.7274 1289.2402 1309.2269 1328.3946 1339.7422 1345.1898 1349.1887 1363.2878 1367.3819 1369.4776 1442.0447 1459.5305 1461.3054 1467.4529 1477.2468 1485.3800 1489.0130 1662.8790 1703.6675 2961.5572 2970.1326 2972.3473 2979.9171 2984.7587 3004.2973 3017.1017 3022.9842 3029.1619 3029.3958 3039.2930 3042.2282 3064.4731 3088.4380 3103.3746 3501.6567
redmass: 7.8478 5.3849 8.1337 3.0566 3.1619 2.8352 2.6668 3.2873 3.3588 3.5009 2.5740 2.8037 4.2046 2.7681 3.2207 3.5264 3.2179 3.0447 2.2178 3.3860 2.4520 1.5283 4.6048 4.3115 1.3086 2.6890 5.2629 2.8870 2.0694 2.8552 2.8792 2.5491 1.9617 2.3552 2.8457 2.7319 2.6588 2.0222 1.9857 1.9762 2.0109 1.8870 3.7680 2.1673 1.2608 2.0934 1.3161 1.5078 1.3260 1.4305 1.3970 1.4661 1.2138 1.4124 1.4233 1.4163 1.3987 1.3735 1.4489 1.5002 1.6979 1.3858 1.0838 1.0804 1.0865 1.0839 1.0752 1.0786 1.0900 8.0994 12.5759 1.0633 1.0608 1.0627 1.0627 1.0636 1.0641 1.0970 1.0973 1.0706 1.0918 1.1005 1.1001 1.1012 1.0863 1.0995 1.0639
irintensity: 0.4582 0.7735 1.9063 0.8082 0.4608 0.3077 1.4167 1.3850 0.8559 4.0000 1.8314 2.5586 1.9824 0.8369 3.5362 4.9205 5.6667 8.1777 3.7760 21.1471 26.2424 104.9675 18.4430 28.2018 1.7353 0.4672 4.6416 4.7622 29.6459 35.1779 19.2747 33.9738 14.5529 6.6805 23.4324 31.4537 28.1454 11.3117 69.0136 177.8304 11.5899 18.4815 214.4762 3.6132 2.7992 4.0376 3.6524 16.2573 1.7547 2.1233 0.4643 1.3917 3.0917 4.9343 16.9392 4.5709 4.8306 1.9699 0.4151 10.6541 39.2944 3.3071 19.4886 7.7031 10.6757 7.4433 5.9663 35.1667 7.2095 144.8106 403.0180 23.4237 24.7913 16.5955 28.7562 31.7490 10.9847 63.2769 9.6422 14.9646 54.3160 29.4669 66.7410 43.8494 5.0545 2.9777 29.3458
temp: 298.150 k
press: 1.00000 atm
elementType: 8 8 8 8 6 6 6 6 6 6 6 6 6 6 6 1 1 1 1 1 1 1 1 1 1 1 1 1 1 1 1
symmnumber: 1
zpe: 674666.7 jmol-1
zpe.correction: 0.256967 hartree
zpe.thermalcorrener: 0.271080 hartree
zpe.thermalcorrenthalpy: 0.272024 hartree
zpe.thermalcorrgfe: 0.215988 hartree
zpe.sumelectzpe: -728.513010 hartree
zpe.sumelectthermal: -728.498897 hartree
zpe.sumelectthermalent: -728.497953 hartree
zpe.sumelectthermalfe: -728.553988 hartree
dipole: 5.4386 1.6009 -3.1805
dipole: 6.5005
quadrupole: -104.8132 -85.0215 -89.5639
quadrupole: -6.5741 9.9140 1.3442
quadrupole: -11.6803 8.1114 3.5689 -6.5741 9.9140 1.3442
hfenergy: -728.7699768 hartree
pointgroup: C01 [X(C11H16O4)]
dipole: 2.1044218 0.6632397 -1.293205 debye
polarizability: 142.7029547|6.2376961|120.9681818|-2.5597184|0.4803501|105.8407312 unknown
InChI: InChI=1S/C11H16O4/c12-9-7-8(10(13)14)11(15-9)5-3-1-2-4-6-11/h8,13H,1-7H2
charge 0 multiplicity 1
31 atoms
O  -1.223866 -1.163694 0.971043
O  -3.453937 -1.479021 0.403413
O  0.013715 2.689273 -1.150361
O  -1.440353 2.205021 0.594233
C  0.029803 -0.59641 0.322098
C  -0.531577 0.365496 -0.798539
C  0.805438 0.036391 1.496891
C  0.743346 -1.831409 -0.290987
C  1.989077 0.99345 1.17444
C  2.076438 -1.595166 -1.038713
C  -1.916581 -0.252094 -1.134388
C  2.893129 0.644355 -0.037013
C  3.186347 -0.862677 -0.246097
C  -2.335546 -1.020524 0.125294
C  -0.716785 1.802512 -0.341626
H  0.14343 0.368695 -1.666405
H  1.169573 -0.807701 2.111776
H  0.074294 0.579556 2.122967
H  0.038445 -2.33974 -0.979653
H  0.91236 -2.534251 0.547484
H  2.612373 1.030959 2.089307
H  1.60792 2.022722 1.033781
H  1.893188 -1.033865 -1.978475
H  2.447728 -2.591255 -1.350978
H  -1.846545 -0.964004 -1.976208
H  -2.69319 0.486235 -1.387221
H  3.847517 1.192681 0.086789
H  2.438544 1.043704 -0.966118
H  4.132544 -0.965552 -0.812543
H  3.352529 -1.362894 0.729844
H  -0.154256 3.623708 -0.846939
