program: Gaussian 09
title: 000299355
version: EM64L-G09RevD.01
frameworkgroup: C1[X(C9H10N2O3)]
method: RPBEPBE
basis: SDD
operation: Freq
keyword: #p
keyword: freq=noraman
keyword: PBEPBE/SDD
title: #p freq=noraman PBEPBE/SDD
converged: YES YES NO NO
title: Mulliken charges:
elementType: O O O N N C C C C C C C C C H H H H H H H H H H
charge: -0.398891 -0.276939 -0.245785 -0.426828 -0.000402 -0.095249 -0.670147 0.183288 0.246851 0.152415 -0.272181 -0.428863 -0.193243 -0.322134 0.286793 0.342051 0.272909 0.240639 0.213836 0.233948 0.285510 0.235311 0.246468 0.390643
chargesum: 0.00000
title: Mulliken charges with hydrogens summed into heavy atoms:
elementType: O O O N N C C C C C C C C C
charge: -0.008248 -0.276939 -0.245785 -0.084777 -0.000402 0.191544 0.057237 0.183288 0.246851 0.152415 -0.038232 -0.143352 0.042068 -0.075666
polarizability: 1.66977821e+02 7.43645791e+00 1.23638902e+02 4.35317499e+00 4.32242213e+00 6.21073684e+01
1716.lowfreq: -11.2218 -5.2694 -0.0010 -0.0009 -0.0005 6.2130 28.9463 51.7115 63.1730
frequency: 28.8526 51.7104 63.1711 71.2106 92.5949 180.4958 201.9120 208.4599 237.1437 288.4498 309.0107 359.2382 386.8836 432.2407 449.9616 534.0406 568.8379 590.3573 602.9102 612.0552 684.0507 700.3322 709.6086 721.8108 787.2857 822.0635 873.8817 919.2011 932.1981 960.3457 986.9214 1000.8869 1024.0481 1051.2067 1060.0534 1077.5959 1108.6878 1132.6946 1181.7333 1202.0497 1235.1937 1273.6432 1306.7733 1307.0628 1328.6547 1350.9125 1385.6019 1404.7411 1449.1769 1465.1395 1481.1686 1497.3491 1543.1499 1581.3961 1590.4159 1648.4985 3001.6210 3021.1558 3107.9541 3119.3609 3127.7327 3136.8416 3156.2669 3168.9240 3520.1579 3522.0446
redmass: 4.8177 6.6436 5.8466 6.3678 5.0632 4.3961 5.6574 3.5515 1.1339 4.0937 6.9938 3.4913 3.2138 4.8024 5.2862 3.9587 2.6442 1.2580 1.6811 4.9554 6.4652 4.2994 4.8100 1.7521 4.1489 1.8697 3.3625 2.3025 1.3691 1.4977 1.4268 3.4961 4.0874 2.5683 1.6779 2.9017 1.8163 1.8523 2.6899 1.2763 1.3964 1.9778 1.3756 8.2873 1.2690 1.9781 1.3322 2.1450 1.8718 1.2177 1.0485 1.9372 5.7713 5.8396 7.6198 8.4074 1.0349 1.0825 1.1013 1.1015 1.0888 1.0910 1.0924 1.0997 1.0668 1.0748
irintensity: 1.2945 0.9173 3.1967 3.5609 1.5428 3.9569 9.8985 2.2941 0.0801 1.7600 1.6123 0.8115 7.3895 14.9929 4.1114 70.3176 34.8891 98.7102 68.1229 6.0206 6.7796 48.1834 10.4261 68.7040 2.1175 21.6122 31.4508 13.6648 0.9185 5.2067 0.3665 2.8116 23.2559 244.1158 21.1488 31.9184 26.1847 8.1187 4.3295 6.6542 4.5300 22.8380 18.8819 2.9014 2.9813 153.0116 38.5452 16.9940 74.9126 78.6580 16.4900 230.1850 36.8439 41.4321 159.0563 162.1141 17.1957 11.6778 19.0600 9.1995 4.7321 18.6814 3.2847 20.5405 72.1794 21.9768
temp: 298.150 k
press: 1.00000 atm
elementType: 8 8 8 7 7 6 6 6 6 6 6 6 6 6 1 1 1 1 1 1 1 1 1 1
symmnumber: 1
zpe: 478130.2 jmol-1
zpe.correction: 0.182110 hartree
zpe.thermalcorrener: 0.195314 hartree
zpe.thermalcorrenthalpy: 0.196258 hartree
zpe.thermalcorrgfe: 0.140679 hartree
zpe.sumelectzpe: -683.121099 hartree
zpe.sumelectthermal: -683.107895 hartree
zpe.sumelectthermalent: -683.106951 hartree
zpe.sumelectthermalfe: -683.162530 hartree
dipole: -3.2427 3.8143 0.9342
dipole: 5.0928
quadrupole: -72.9054 -85.5558 -83.1569
quadrupole: 8.3356 0.8120 -3.7307
quadrupole: 7.6340 -5.0164 -2.6176 8.3356 0.8120 -3.7307
hfenergy: -683.303209 hartree
pointgroup: C01 [X(C9H10N2O3)]
dipole: -1.2974948 -1.5122397 -0.2104615 debye
dipolederiv: -1.3240291 0.1900178 0.2258998 0.1277794 -0.269063 -0.0209696 0.2384064 -0.0336679 -0.4577535 -0.7788589 0.1559563 -0.0031482 -0.0978049 -0.8638629 -0.1646023 -0.0886829 -0.1124505 -0.4005996 -0.7795448 -0.035427 0.0805252 0.1932308 -0.9120039 -0.0438 0.123281 -0.0522791 -0.319001 -1.2683539 -0.1705269 -0.1584241 -0.4141997 -0.5525108 0.0120465 -0.1957566 0.0301943 -0.4669428 -0.3819617 0.0661663 0.000726 0.0648816 -0.3519719 0.0070027 0.0090006 0.0082819 -0.2485277 0.5843772 -0.0959336 0.093894 -0.3543587 -0.1088371 0.0326186 0.0180771 0.0056592 0.2685975 -0.16556 -0.0956013 -0.0107148 0.0126493 0.0052023 0.0444989 -0.0365394 0.0272181 0.0361033 1.7582762 -0.0160522 0.1263677 0.2960256 1.0467049 0.2910583 0.2081239 0.1868979 0.2945147 -0.3664523 -0.0038769 0.0236108 0.1672126 -0.247525 -0.0092578 0.0687079 -0.0127997 0.033488 1.6038424 -0.0002959 -0.360865 -0.0951433 1.1798438 0.0505745 -0.3656852 0.0983913 0.2537931 0.1146394 0.0256904 -0.0351403 -0.0679709 0.0935281 -0.021261 -0.0730254 -0.0090227 -0.1047268 0.1393475 0.0453814 -0.0226896 0.0089382 0.2597206 -0.0276197 0.0097332 -0.0226677 -0.0379231 -0.3665507 0.0284941 0.0163247 -0.147922 0.0875691 -0.0083383 0.0122341 -0.0151913 -0.101575 0.3678665 -0.1386625 -0.0298659 0.0730545 0.1434778 -0.02158 -0.0507991 -0.0055448 -0.0625633 0.0325393 -0.015843 -0.0100932 0.0805384 0.0817815 -0.0510865 0.0413268 -0.016659 -0.0185526 0.3020979 0.0255137 -0.0189854 0.16352 0.175962 -0.0439227 0.0162835 -0.0429992 0.2953586 0.0921438 -0.098729 0.0220494 -0.102784 -0.002103 0.0314898 0.0454747 0.0166033 0.0838988 -0.1227616 0.0844409 0.0021687 0.1003398 0.0990443 0.0097966 -0.0044473 -0.0156931 0.0754302 0.1109798 0.0290621 0.0129394 0.0047682 0.006509 -0.1175064 -0.0099291 -0.0487007 -0.0773166 -0.0194784 -0.1016619 0.0244247 -0.1020749 0.0506122 0.0162053 0.0400069 0.0060416 0.1307185 0.1271315 0.0343098 0.0000244 0.0390957 0.0019474 0.0139014 -0.0264859 0.0098106 0.1331846 0.0764562 0.0291661 0.005178 0.0636091 -0.0964248 0.0184574 0.0059467 0.0226605 0.158524 -0.084664 0.0923493 0.012084 0.0722649 0.054467 0.0015169 0.0226827 -0.0050373 0.1363363 0.3485178 -0.0339383 0.00371 -0.0856495 0.1179322 0.0007776 -0.0079347 -0.0190457 0.3955344 unknown
polarizability: 166.7457778|-8.4602441|124.1030104|-3.570604|-2.0554887|61.8753031 unknown
InChI: InChI=1S/C9H10N2O3/c1-6(9(13)14)11-8(12)7-3-2-4-10-5-7/h2-6,11,13H,1H3
charge 0 multiplicity 1
24 atoms
O  -4.546823 -0.333362 0.45841
O  -0.01984 2.043752 0.396121
O  -2.906792 -1.905264 -0.028082
N  -0.961334 -0.007949 -0.133049
N  3.895278 0.577583 -0.218463
C  -2.333572 0.498525 -0.014069
C  -2.76227 1.373692 -1.226027
C  0.125254 0.810081 0.114073
C  1.48526 0.169087 0.024686
C  -3.249461 -0.710543 0.136231
C  1.721263 -1.226282 0.120142
C  2.609373 1.023126 -0.135157
C  3.046813 -1.704373 0.038645
C  4.096444 -0.772657 -0.133512
H  -2.404002 1.124191 0.895807
H  -0.860037 -0.992593 -0.393757
H  -2.073206 2.230798 -1.292472
H  -3.790001 1.747104 -1.0838
H  -2.712815 0.795882 -2.165329
H  0.90202 -1.935845 0.285902
H  2.453653 2.105361 -0.18976
H  3.266334 -2.773545 0.116362
H  5.138733 -1.104798 -0.199667
H  -5.127775 -1.138871 0.526864
