program: Gaussian 09
title: 000299336
version: EM64L-G09RevD.01
frameworkgroup: C1[X(C16H20N2O2)]
method: RPBEPBE
basis: SDD
operation: Freq
keyword: #p
keyword: freq=noraman
keyword: PBEPBE/SDD
title: #p freq=noraman PBEPBE/SDD
converged: YES YES NO NO
title: Mulliken charges:
elementType: O O N N C C C C C C C C C C C C C C C C H H H H H H H H H H H H H H H H H H H H
charge: -0.469498 -0.427805 -0.071781 -0.403612 -0.293990 -0.167753 -0.109138 -0.091388 -0.598540 -0.465025 0.482454 -0.245455 0.369741 -0.411621 -0.649935 0.223112 -0.492013 -0.442574 -0.366532 -0.205883 0.239012 0.235988 0.229953 0.219980 0.259911 0.216231 0.200307 0.212279 0.184199 0.260454 0.221847 0.223983 0.196638 0.237267 0.265134 0.362284 0.303242 0.227844 0.216381 0.324302
chargesum: 0.00000
title: Mulliken charges with hydrogens summed into heavy atoms:
elementType: O O N N C C C C C C C C C C C C C C C C
charge: -0.107214 -0.103503 -0.071781 -0.100370 -0.054978 0.068234 0.120815 0.128592 -0.122398 -0.052439 0.482454 -0.245455 0.369741 0.033032 -0.007467 0.223112 -0.254745 -0.177440 -0.138688 0.010498
polarizability: 2.27548362e+02 -1.04099316e+01 1.97445773e+02 1.38141267e+01 2.71316053e+01 1.36529029e+02
1716.lowfreq: -13.9185 -6.8057 0.0003 0.0005 0.0007 6.8810 49.9646 68.7291 85.9778
frequency: 49.9459 68.7154 85.9740 99.3962 123.8237 171.9244 180.7275 206.7608 224.4288 228.8197 248.1998 251.4139 274.3762 298.2405 316.1094 332.4450 352.1672 355.9751 367.0559 404.2102 458.1255 459.8603 483.0787 500.4292 519.7467 539.9256 553.8001 584.2443 596.7298 612.0354 622.5637 712.7729 733.8650 748.2255 756.2464 775.6592 784.8717 799.5376 830.2979 859.2040 869.9282 885.5330 914.0257 928.8186 953.7671 962.7064 974.5637 995.1204 1027.8413 1036.4806 1047.1449 1059.3363 1073.8081 1089.3535 1096.8436 1105.9718 1110.5944 1120.6388 1150.0379 1164.7298 1176.2335 1182.2927 1187.2658 1211.6842 1221.6435 1231.9863 1256.2052 1258.9377 1271.3882 1282.4167 1290.5772 1296.1377 1317.7924 1332.2938 1336.2949 1342.9630 1353.9759 1363.5118 1367.8978 1377.6846 1391.5408 1404.0738 1416.5598 1432.0213 1445.6524 1455.9779 1463.8000 1466.6742 1479.0844 1495.8317 1498.3640 1563.4733 1613.8711 1626.7382 2872.6474 2893.0778 2949.1251 2962.3214 2970.0605 2973.9800 2991.0178 2991.8590 3006.4277 3009.7457 3045.1366 3064.6628 3104.4824 3119.1821 3134.2596 3155.8037 3219.2763 3552.0691 3553.1296 3612.6929
redmass: 5.5959 4.9177 3.5317 4.6233 2.9742 3.5634 3.1322 3.7695 2.6401 2.6979 1.5789 3.4553 2.4385 3.1094 2.5878 1.4022 1.5364 2.7050 3.0539 3.7703 3.8033 4.0565 3.7844 1.3187 3.3117 3.0159 4.6073 3.9731 3.4512 3.2936 3.9143 4.4922 4.9212 1.8814 2.2685 2.1747 2.5142 2.2108 5.0803 3.2354 3.0145 1.4934 2.7328 1.8159 1.3292 4.3554 2.5739 2.1506 2.4843 2.3279 2.1280 2.0174 2.5093 2.5534 2.1490 1.7842 2.2214 1.9702 1.7918 1.3685 1.2916 1.2777 1.6196 1.4661 1.4942 1.7211 1.3242 1.5066 1.4060 1.4794 1.6988 1.6845 1.5759 1.3560 1.2600 2.0002 1.4091 1.4838 1.4458 1.2981 1.5141 3.1193 2.9006 1.1626 1.3717 2.4559 1.1131 1.0842 1.0814 1.0890 3.0942 6.7548 7.3852 7.8511 1.0554 1.0679 1.0708 1.0825 1.0835 1.0838 1.0592 1.0838 1.0747 1.0909 1.1014 1.1003 1.0934 1.0867 1.0908 1.0983 1.0981 1.0656 1.0661 1.0808
irintensity: 0.6331 1.5384 3.0812 0.5634 2.5140 0.5426 5.0358 8.5732 1.0518 2.7532 0.4344 26.9441 1.2261 11.2445 38.1571 148.6032 56.0277 31.1579 52.4587 4.8474 5.3342 4.5669 2.5120 84.9019 43.8063 4.4586 6.1341 3.1938 1.9172 4.6501 2.1682 5.0830 0.7153 40.3651 30.1712 33.3192 18.9192 1.1915 4.9326 0.2571 0.3775 0.8169 34.4880 12.0808 1.9924 76.5971 19.3970 13.1343 26.5129 0.4062 53.1806 25.2369 12.3619 0.6920 22.1327 3.4957 20.6490 6.3590 4.7105 20.1501 7.7355 9.1564 39.8252 1.0731 4.2505 9.3675 23.3722 6.1109 17.9920 7.3184 7.8901 12.8798 4.6765 1.2246 8.9736 34.9041 2.1209 6.4577 0.9890 14.1109 12.7689 9.4472 7.6218 5.8681 2.4861 34.6287 13.9033 7.8501 5.1068 13.1808 0.9732 0.9323 11.2283 8.4528 89.3058 74.8249 83.5634 16.5124 18.2447 34.5865 53.6279 32.8533 61.3419 60.3562 17.0378 39.2506 8.8616 5.1704 16.1687 34.4681 1.6234 6.7301 5.1408 61.4584
temp: 298.150 k
press: 1.00000 atm
elementType: 8 8 7 7 6 6 6 6 6 6 6 6 6 6 6 6 6 6 6 6 1 1 1 1 1 1 1 1 1 1 1 1 1 1 1 1 1 1 1 1
symmnumber: 1
zpe: 877658.1 jmol-1
zpe.correction: 0.334282 hartree
zpe.thermalcorrener: 0.351709 hartree
zpe.thermalcorrenthalpy: 0.352653 hartree
zpe.thermalcorrgfe: 0.290594 hartree
zpe.sumelectzpe: -880.152995 hartree
zpe.sumelectthermal: -880.135568 hartree
zpe.sumelectthermalent: -880.134624 hartree
zpe.sumelectthermalfe: -880.196683 hartree
dipole: 2.1997 2.4847 -0.9331
dipole: 3.4472
quadrupole: -97.9281 -116.9811 -121.9460
quadrupole: -3.3813 14.1374 9.9772
quadrupole: 14.3570 -4.6960 -9.6609 -3.3813 14.1374 9.9772
hfenergy: -880.4872771 hartree
pointgroup: C01 [X(C16H20N2O2)]
dipole: -0.8442147 0.9959222 0.3671186 debye
polarizability: 227.8646539|9.7798318|197.2438257|13.7589245|-27.0888164|136.4146839 unknown
InChI: InChI=1S/C16H20N2O2/c1-18-7-10(8-19)16(20)15-11-3-2-4-12-14(11)9(6-17-12)5-13(15)18/h2-4,6,10,13,15-17,19-20H,5,7-8H2,1H3
charge 0 multiplicity 1
40 atoms
O  1.066689 -0.809367 -1.521466
O  3.966879 -2.73834 -0.636188
N  2.091398 1.595795 0.921982
N  -3.662903 0.935566 -1.000494
C  0.497319 -0.307473 0.877675
C  0.653308 1.252815 0.776164
C  1.439586 -1.056902 -0.11454
C  2.897194 -0.584624 0.050568
C  -0.039193 1.906481 -0.484779
C  2.983038 0.9520 -0.070285
C  -0.95149 -0.744296 0.700693
C  -1.79026 0.122855 -0.035041
C  -1.453981 1.39952 -0.610082
C  3.840694 -1.299149 -0.936305
C  2.359483 3.032805 1.103042
C  -3.168962 -0.160294 -0.280635
C  -1.531461 -1.936648 1.180727
C  -2.623862 1.879467 -1.19477
C  -3.749614 -1.358677 0.196292
C  -2.90677 -2.232008 0.923332
H  0.850359 -0.586148 1.891488
H  0.137209 1.669552 1.666095
H  1.381211 -2.14763 0.087268
H  3.202317 -0.841333 1.087858
H  0.543558 1.641134 -1.386436
H  -0.016421 3.007629 -0.380247
H  4.018431 1.278579 0.148933
H  2.758643 1.255477 -1.12135
H  4.839918 -0.810865 -0.932446
H  3.423203 -1.267437 -1.954036
H  3.404089 3.173193 1.438036
H  1.693941 3.436579 1.888103
H  2.215847 3.649648 0.182093
H  -0.933552 -2.64619 1.765397
H  -2.813928 2.80511 -1.735518
H  0.115366 -1.062597 -1.637791
H  -4.618911 1.047487 -1.329718
H  -4.801507 -1.612065 0.024988
H  -3.326459 -3.167839 1.309991
H  4.376294 -2.83601 0.2610
