program: Gaussian 09
title: 000299308
version: EM64L-G09RevD.01
frameworkgroup: C1[X(C8H7ClN2O3)]
method: RPBEPBE
basis: SDD
operation: Freq
keyword: #p
keyword: freq=noraman
keyword: PBEPBE/SDD
title: #p freq=noraman PBEPBE/SDD
converged: YES YES NO NO
title: Mulliken charges:
elementType: Cl O O O N N C C C C C C C C H H H H H H H
charge: 0.231205 -0.254497 -0.200989 -0.200790 -0.406863 -0.513370 0.076831 0.358120 0.243436 -0.672579 0.257445 -0.383898 -0.256323 -0.167076 0.348501 0.237442 0.254846 0.238822 0.288041 0.258709 0.262985
chargesum: 0.00000
title: Mulliken charges with hydrogens summed into heavy atoms:
elementType: Cl O O O N N C C C C C C C C
charge: 0.231205 -0.254497 -0.200989 -0.200790 -0.058362 -0.513370 0.076831 0.358120 0.243436 0.058532 0.257445 -0.095857 0.002386 0.095909
polarizability: 1.50893250e+02 -6.80158636e-02 1.11377593e+02 -4.31668523e+00 1.74851817e-01 8.08439584e+01
1716.lowfreq: -4.6765 0.0014 0.0020 0.0028 2.6431 7.4906 36.8389 43.3663 80.0475
frequency: 36.7633 43.3341 80.0271 133.0728 148.2871 171.6218 188.0563 231.6206 239.8594 285.4458 302.0172 320.3514 363.6922 462.4708 484.8951 531.2581 589.6747 594.4936 640.8080 667.8886 683.5473 694.1364 730.5991 750.5766 835.6278 867.7863 870.1635 890.6409 909.9289 952.2737 1001.3066 1036.1220 1041.2999 1065.6094 1100.2380 1131.4851 1140.6238 1193.3979 1213.7791 1237.4179 1268.8374 1351.8586 1360.9473 1384.1433 1463.9548 1467.3561 1488.8118 1585.4757 1676.4164 1738.7211 2997.7875 3104.6073 3113.2663 3225.7403 3242.1592 3270.8485 3596.8148
redmass: 5.0208 8.3082 8.6428 5.8998 5.5255 8.0984 11.2125 1.4226 2.0572 6.9451 18.9542 3.7669 5.2034 2.7982 1.5315 6.7173 3.1951 9.2544 4.9581 6.6262 5.1547 11.8843 1.2821 5.3523 1.2669 5.1511 6.7025 1.3641 3.1081 1.9047 1.7842 2.6885 6.9635 2.7899 3.0554 2.2060 2.4514 3.9034 2.1371 2.8371 6.5917 2.1441 1.8017 1.2302 1.0507 1.0853 4.9525 6.9166 12.3917 10.9886 1.0340 1.1018 1.1013 1.0918 1.0998 1.1087 1.0800
irintensity: 0.8390 0.5170 0.0225 3.9403 2.8336 0.5626 1.7991 1.4882 1.9445 0.3024 4.5638 1.6902 2.4217 20.0645 147.8828 5.9711 5.8609 48.9157 2.2982 3.1880 5.6559 35.1474 84.2832 25.9510 27.0359 23.1822 5.6732 0.8175 29.8728 1.5327 32.3541 15.2082 37.6003 17.0119 21.5912 16.1638 37.0408 94.6614 29.6119 22.0967 123.6051 17.4947 24.4489 10.5849 9.8948 5.0515 5.4694 2.8872 511.1179 299.9042 9.7295 14.7051 10.1072 2.2473 1.3919 0.0685 62.4712
temp: 298.150 k
press: 1.00000 atm
elementType: 17 8 8 8 7 7 6 6 6 6 6 6 6 6 1 1 1 1 1 1 1
symmnumber: 1
zpe: 378019.6 jmol-1
zpe.correction: 0.143980 hartree
zpe.thermalcorrener: 0.156779 hartree
zpe.thermalcorrenthalpy: 0.157723 hartree
zpe.thermalcorrgfe: 0.103506 hartree
zpe.sumelectzpe: -1103.231323 hartree
zpe.sumelectthermal: -1103.218525 hartree
zpe.sumelectthermalent: -1103.217581 hartree
zpe.sumelectthermalfe: -1103.271798 hartree
dipole: -4.2105 0.4829 0.9103
dipole: 4.3348
quadrupole: -81.9655 -93.0079 -85.1600
quadrupole: -5.9285 5.3279 7.4289
quadrupole: 4.7456 -6.2967 1.5511 -5.9285 5.3279 7.4289
hfenergy: -1103.3753035 hartree
pointgroup: C01 [X(C8H7Cl1N2O3)]
dipole: 1.5254492 0.3012826 -0.700539 debye
dipolederiv: -0.2477577 -0.0527936 0.2098197 -0.1175087 0.0172154 0.1022093 0.2791835 0.0777316 -0.0494331 -0.4938689 0.0043199 -0.1580721 0.0072057 -0.3334823 0.2021102 -0.2033455 0.2090912 -0.4152566 -0.5027918 0.1483198 0.019549 0.3489759 -0.9597789 0.0323921 -0.0743824 0.1652054 -0.3363194 -0.9262824 0.4319152 0.1186519 0.5009616 -0.8342637 -0.0445079 0.183574 -0.053867 -0.3825901 -1.1158479 -0.022309 0.2099504 0.0470168 -0.4659969 -0.042383 0.2871072 -0.0157005 -0.7311311 -0.1975948 0.6878008 -0.293178 0.5258715 -1.0638615 0.0574141 -0.2592666 -0.0521975 -0.0538513 0.5416037 -0.132371 0.1747436 -0.3055936 0.2266247 0.2300288 0.1204861 0.1930156 0.2581724 0.1702125 0.1013602 0.0332695 0.1021311 0.1091867 -0.2055147 0.1493067 -0.1574374 0.071072 1.0203428 -0.5280084 -0.1853063 -0.6561216 1.1355295 0.0454161 -0.1531182 -0.0658443 0.2748906 -0.1523624 -0.0119708 -0.0012775 0.0059622 -0.0121394 0.0392925 -0.0130414 -0.0674181 -0.0355944 1.4227466 -0.5751814 -0.339327 -0.3883133 1.7051465 -0.3682925 -0.571065 -0.241815 0.6859922 -0.1042231 0.0849533 -0.0248318 0.0343481 -0.0556102 -0.0357198 0.0046849 -0.0097333 -0.1357164 -0.0278965 0.0189184 0.0911284 0.0441366 -0.1328663 -0.0205427 0.0469849 -0.0375618 -0.1173016 0.0946293 -0.0125193 0.1634776 -0.0832441 0.0360843 -0.1763419 0.2227755 -0.1529548 0.1122229 0.2305186 0.0114776 0.1075249 0.0440506 0.2144231 0.005881 0.0819172 0.0262031 0.3351071 0.0591938 -0.0628756 0.0711397 -0.0509383 0.0159068 0.0595306 0.0854805 0.0387823 0.006772 0.0604163 0.0737765 0.0000537 0.1068793 -0.0151515 -0.0171678 0.0128691 0.0361817 0.0795284 -0.0886504 -0.034954 -0.0935153 -0.0382101 0.0907886 -0.0284959 -0.1080347 -0.0391443 0.0295214 0.1546673 -0.0570723 0.0143683 -0.0401935 0.0799947 0.062223 0.0343538 0.0481379 0.1410239 0.0190637 -0.0151514 -0.0894677 -0.0113082 0.151975 0.0350487 -0.0991039 0.0308929 0.1138022 0.0838813 -0.0576354 -0.0287012 -0.0761082 0.0902754 0.0674197 -0.0273657 0.0684324 0.1490887 unknown
polarizability: 147.4159299|4.1623114|104.6663894|-12.3530754|-14.7233789|91.0324819 unknown
InChI: InChI=1S/C8H7ClN2O3/c1-8(5-3-2-4-14-5)6(12)11(9)7(13)10-8/h2-4,10H,1H3
charge 0 multiplicity 1
21 atoms
Cl -3.187881 -1.267845 1.545118
O  2.022881 1.081961 -0.795278
O  -0.43439 -2.480095 0.416748
O  -2.9046 1.571759 0.188642
N  -0.864439 0.866676 -0.823087
N  -1.915534 -0.611456 0.481426
C  0.008677 -0.335321 -0.825303
C  1.361086 -0.03024 -0.222989
C  -0.771678 -1.31896 0.107728
C  0.137069 -0.950787 -2.244182
C  -1.998427 0.750543 -0.042123
C  2.158172 -0.597727 0.75294
C  3.376741 0.187655 0.812527
C  3.262202 1.191334 -0.130556
H  -0.588329 1.752678 -1.244635
H  0.709094 -0.267343 -2.895105
H  0.671088 -1.913351 -2.180427
H  -0.861034 -1.117947 -2.683932
H  1.909662 -1.476495 1.343804
H  4.22424 0.021642 1.47432
H  3.895198 2.013617 -0.451335
