program: Gaussian 09
title: 000299310
version: EM64L-G09RevD.01
frameworkgroup: C1[X(C10H13N3O4)]
method: RPBEPBE
basis: SDD
operation: Freq
keyword: #p
keyword: freq=noraman
keyword: PBEPBE/SDD
title: #p freq=noraman PBEPBE/SDD
converged: NO YES NO NO
title: Mulliken charges:
elementType: O O O O N N N C C C C C C C C C C H H H H H H H H H H H H H
charge: -0.240281 -0.288395 -0.289024 -0.239451 -0.127509 -0.148186 -0.396501 -0.366265 -0.387371 -0.299669 -0.292396 0.262215 -0.535277 0.230833 -0.069217 -0.288268 0.152097 0.265700 0.233180 0.232608 0.274180 0.227653 0.203143 0.199365 0.230565 0.268041 0.273507 0.292189 0.362428 0.260105
chargesum: 0.00000
title: Mulliken charges with hydrogens summed into heavy atoms:
elementType: O O O O N N N C C C C C C C C C C
charge: -0.240281 -0.288395 -0.289024 -0.239451 -0.127509 -0.148186 -0.034073 0.132615 0.119417 0.131128 0.137535 0.262215 0.006270 0.230833 0.222971 -0.028163 0.152097
polarizability: 1.74245416e+02 -1.02323314e+00 1.36724007e+02 -2.28747775e+01 -7.55816541e+00 1.09372416e+02
1716.lowfreq: -18.3510 -5.6355 -0.7278 -0.0004 -0.0002 0.0002 18.3614 31.9846 59.8809
frequency: 17.8310 30.9188 59.8743 79.9402 83.3935 149.4716 174.2207 178.1813 234.4127 273.7104 296.1816 325.4853 369.7094 377.4887 399.1455 416.9378 439.9073 462.6944 467.4252 516.1801 555.0156 573.3539 591.6986 663.4600 685.9750 697.8169 727.9022 751.4098 770.6032 800.2513 806.2231 817.6057 836.4842 894.6503 933.8176 941.4737 951.6667 962.0765 1008.2760 1031.6686 1051.3293 1070.6532 1073.1147 1113.8003 1171.9271 1173.2804 1192.7405 1198.9026 1211.7006 1254.7508 1265.3050 1277.2036 1305.1997 1331.8868 1340.3713 1344.6720 1348.2196 1356.7087 1368.2152 1379.7786 1409.4432 1426.9605 1446.1260 1450.7046 1454.6280 1459.4672 1471.4257 1580.3518 1602.9325 1633.9794 1667.6539 2955.1666 2960.0248 2988.4704 2995.4085 3049.7588 3089.6332 3090.1740 3092.1803 3094.7844 3125.7512 3177.3511 3217.5501 3523.2347
redmass: 7.1701 4.4982 5.3081 9.8333 4.2957 5.7391 4.4930 7.9761 2.8454 3.8552 4.4716 3.4669 8.3371 4.3524 2.0556 3.2912 2.8960 3.9250 3.3695 6.6877 5.0402 2.3400 5.3643 3.3797 3.1082 2.4138 4.7408 4.0741 2.0731 4.2698 2.3973 3.5318 1.6586 2.7999 2.7941 3.0633 1.4691 2.2006 2.4105 2.3497 2.2491 3.5233 2.0207 2.1405 5.9562 3.6938 1.1173 1.2527 2.3507 1.4027 1.3757 1.2147 2.7438 1.2631 1.2173 1.5624 1.4071 1.2821 1.3412 1.8158 3.4054 2.9771 1.0831 1.0880 1.1041 1.1030 1.0993 7.0008 5.1120 8.9969 6.2177 1.0683 1.0681 1.0639 1.0640 1.0624 1.0957 1.0976 1.0998 1.0990 1.1012 1.0924 1.0976 1.0770
irintensity: 0.3201 2.6192 1.4548 6.7209 6.6539 2.1101 2.7290 7.2704 3.6037 9.7768 4.7641 7.7881 19.7803 5.6748 1.1077 16.0188 3.3838 16.1643 16.9885 8.9737 29.8007 11.8802 8.1062 0.9062 18.9259 7.4062 0.7612 5.9667 48.2098 17.4749 94.5285 18.5130 0.1470 6.1172 2.8635 20.2664 1.7785 11.4373 9.7725 19.3558 39.0470 29.6720 8.3538 7.6848 7.8199 0.5912 32.6822 31.7203 97.1334 23.3923 46.3403 13.3673 75.1349 0.5387 8.9189 49.6608 23.0906 6.4555 2.7834 20.4301 47.8445 73.8800 11.4786 16.9295 18.7689 5.2928 52.7354 272.5947 32.5188 334.8884 746.9480 36.2007 49.6812 45.9225 62.8266 17.6608 9.1149 23.9691 10.8882 26.1430 1.7227 3.1330 0.2593 57.3386
temp: 298.150 k
press: 1.00000 atm
elementType: 8 8 8 8 7 7 7 6 6 6 6 6 6 6 6 6 6 1 1 1 1 1 1 1 1 1 1 1 1 1
symmnumber: 1
zpe: 616958.8 jmol-1
zpe.correction: 0.234987 hartree
zpe.thermalcorrener: 0.249972 hartree
zpe.thermalcorrenthalpy: 0.250916 hartree
zpe.thermalcorrgfe: 0.190891 hartree
zpe.sumelectzpe: -852.760595 hartree
zpe.sumelectthermal: -852.745610 hartree
zpe.sumelectthermalent: -852.744666 hartree
zpe.sumelectthermalfe: -852.804692 hartree
dipole: -2.7054 1.3737 2.0667
dipole: 3.6712
quadrupole: -116.6178 -105.1146 -99.7325
quadrupole: 3.4761 5.3364 0.1220
quadrupole: -9.4628 2.0404 7.4225 3.4761 5.3364 0.1220
hfenergy: -852.9955823 hartree
pointgroup: C01[X(C10H13N3O4)]
dipole: 1.0194847 0.6391206 -0.7989418 debye
polarizability: 174.6116248|4.5196331|137.4659756|-22.183585|4.8869615|108.2642394 unknown
InChI: InChI=1S/C10H13N3O4/c14-8-1-2-13(10(16)11-8)7-9(15)12-3-5-17-6-4-12/h1-2,11H,3-7H2
charge 0 multiplicity 1
30 atoms
O  4.045802 -1.091017 0.853946
O  0.947239 2.615517 0.002066
O  -0.49467 -1.710252 -1.655145
O  -4.232616 -1.366703 1.140673
N  2.268346 0.75251 -0.477626
N  -1.1045 0.425257 -0.865987
N  -2.36579 -1.477766 -0.263373
C  3.36118 1.25011 0.397594
C  2.542535 -0.57955 -1.072709
C  3.696782 0.199754 1.472613
C  2.91878 -1.578017 0.045167
C  1.129894 1.519485 -0.627386
C  0.022393 1.053544 -1.597269
C  -1.270664 -0.978691 -0.97201
C  -1.942251 1.206453 -0.066393
C  -3.000447 0.676547 0.629951
C  -3.293353 -0.753607 0.561646
H  3.030314 2.199543 0.849543
H  4.255865 1.434874 -0.228627
H  3.389497 -0.486894 -1.780802
H  1.658988 -0.970802 -1.601193
H  4.584493 0.501419 2.051469
H  2.833067 0.068815 2.159419
H  2.035029 -1.758978 0.694637
H  3.253399 -2.53277 -0.390805
H  0.355412 0.34225 -2.365344
H  -0.349848 1.96741 -2.089618
H  -1.675067 2.265678 -0.021961
H  -2.518546 -2.488946 -0.337706
H  -3.644267 1.304328 1.246033
