program: Gaussian 09
title: 000299307
version: EM64L-G09RevD.01
frameworkgroup: C1[X(C10H9ClN2O3S)]
method: RPBEPBE
basis: SDD
operation: Freq
keyword: #p
keyword: freq=noraman
keyword: PBEPBE/SDD
title: #p freq=noraman PBEPBE/SDD
converged: YES YES NO NO
title: Mulliken charges:
elementType: Cl S O O O N N C C C C C C C C C C H H H H H H H H H
charge: 0.226908 0.255720 -0.156080 -0.189248 -0.222219 -0.284760 -0.515257 0.123512 0.218678 -0.020698 -0.718362 0.336307 0.278107 -0.269402 -0.133337 -0.744482 -0.496721 0.280211 0.232049 0.249499 0.257022 0.248175 0.254488 0.261751 0.260551 0.267589
chargesum: 0.00000
title: Mulliken charges with hydrogens summed into heavy atoms:
elementType: Cl S O O O N N C C C C C C C C C C
charge: 0.226908 0.255720 -0.156080 -0.189248 -0.222219 -0.284760 -0.515257 0.123512 0.218678 -0.020698 0.043397 0.336307 0.278107 -0.012379 0.114838 0.032308 -0.229131
polarizability: 1.99636080e+02 -2.86597181e+00 1.43553313e+02 1.51320187e+01 -7.38372776e+00 1.30884416e+02
1716.lowfreq: -8.8048 -7.2612 0.0014 0.0016 0.0021 7.8402 31.6360 40.3253 64.2156
frequency: 31.6090 40.2953 64.2114 76.3602 86.2518 122.6330 150.1057 155.9982 187.3619 210.5214 216.3678 243.5757 268.6699 278.7975 295.7394 316.9507 333.8980 340.7740 382.3271 466.0507 473.4551 543.4393 563.3130 568.3280 588.9618 602.7316 675.1010 684.2220 699.1204 703.0735 706.6715 738.3980 781.5474 822.6139 837.2307 871.4843 912.1500 936.1443 1000.4685 1038.3105 1039.5285 1060.8672 1084.8940 1093.4459 1108.2036 1141.1949 1165.0877 1196.0967 1226.0591 1240.7789 1274.1139 1336.3808 1380.2887 1390.3359 1432.7434 1449.7968 1470.3122 1476.3808 1482.2014 1553.1878 1627.5018 1677.4562 1716.8770 3007.8987 3009.2151 3095.8419 3104.3618 3137.8505 3137.9858 3177.1296 3194.5002 3239.6511
redmass: 6.8463 9.7421 4.4400 7.2540 8.2956 10.2775 1.8134 1.9880 7.5976 7.2633 4.8044 2.6593 2.5724 1.6754 6.7080 6.4294 5.3025 7.6663 5.4854 5.3537 5.9886 4.7889 4.5354 4.0911 4.4427 7.6792 6.1197 7.3805 8.4324 1.2653 4.8730 5.0283 5.2024 4.7469 1.3999 4.0834 1.3998 2.6510 2.5998 1.7473 1.8321 1.7386 3.3518 1.1462 5.4275 4.6976 6.3348 3.2675 4.2947 1.8054 6.3186 2.3370 1.1828 1.2181 1.0789 1.0457 1.5270 1.7804 1.2184 5.8978 8.5781 12.3944 12.5311 1.0354 1.0366 1.0962 1.0998 1.1018 1.1020 1.0898 1.0978 1.1006
irintensity: 0.5350 0.1396 2.2144 1.7113 2.1022 6.8510 1.2659 0.6130 0.5023 4.6830 0.7176 1.6433 0.4973 0.8359 1.1377 1.9626 5.9280 4.4695 0.3691 6.1708 5.1091 17.7242 45.0088 0.6983 4.8136 13.3993 18.4557 4.3224 11.6973 92.2431 26.3045 2.3514 28.5121 14.2961 6.0930 20.4785 0.1745 31.9722 4.8409 10.3278 9.7699 17.6888 17.8276 0.5049 104.3433 58.1414 6.4602 9.0533 10.0240 73.3353 548.3917 6.1387 32.2182 55.9686 25.2534 19.0125 12.0254 2.3813 8.4943 4.8900 106.7425 655.3548 43.9140 8.7738 0.4343 2.8787 13.2804 1.8146 10.5209 5.4724 1.8348 0.4660
temp: 298.150 k
press: 1.00000 atm
elementType: 17 16 8 8 8 7 7 6 6 6 6 6 6 6 6 6 6 1 1 1 1 1 1 1 1 1
symmnumber: 1
zpe: 465009.0 jmol-1
zpe.correction: 0.177113 hartree
zpe.thermalcorrener: 0.193759 hartree
zpe.thermalcorrenthalpy: 0.194703 hartree
zpe.thermalcorrgfe: 0.131802 hartree
zpe.sumelectzpe: -1578.502840 hartree
zpe.sumelectthermal: -1578.486193 hartree
zpe.sumelectthermalent: -1578.485249 hartree
zpe.sumelectthermalfe: -1578.548150 hartree
dipole: 1.5015 0.7629 0.3112
dipole: 1.7128
quadrupole: -108.0967 -119.8008 -105.8736
quadrupole: -6.8524 -4.7925 1.1134
quadrupole: 3.1603 -8.5437 5.3834 -6.8524 -4.7925 1.1134
hfenergy: -1578.6799521 hartree
pointgroup: C01 [X(C10H9Cl1N2O3S1)]
dipole: 0.4984446 -0.432012 -0.1378405 debye
dipolederiv: -0.4345394 0.3087733 0.1374303 0.4616953 -0.2841858 -0.1066888 0.3184535 -0.1589342 0.0469582 -0.1948772 -0.0366228 0.1329064 -0.0071301 0.1098815 0.051296 0.1415419 0.033441 -0.1689427 -0.4292712 -0.1984978 0.0899268 -0.2447858 -0.9295052 0.2821775 0.1068368 0.1808243 -0.3711918 -0.9309971 -0.2241993 0.2836759 -0.2597501 -0.6036508 0.1229237 0.3606011 0.1361491 -0.4396093 -0.6596263 0.2911145 0.2107753 0.0415285 -0.844461 -0.0932944 0.190699 -0.1725047 -0.4573392 -0.8662411 0.3607528 0.2200114 0.2223632 -1.5163376 -0.1702909 0.2130639 -0.1656656 -0.4156203 -0.0885112 -0.9940444 0.0813974 -0.749741 -0.6459592 0.3706001 -0.0943369 0.623745 -0.2695497 0.6708882 0.1749539 0.1598837 0.145893 0.1992292 -0.0178236 0.1282635 -0.123421 0.2489218 0.8143617 0.5014972 -0.4164005 0.3568672 0.9622816 -0.4289707 -0.4097887 -0.3804139 0.4261336 -0.2144965 0.0141995 -0.0873671 0.0249336 -0.203067 -0.0493419 0.0115574 -0.072669 0.289159 -0.0874008 0.0086758 -0.0129813 0.0279093 -0.0731626 -0.0362113 -0.0055933 0.0630339 -0.0362871 1.3728239 0.1315343 -0.4694615 0.1592918 1.7659823 -0.1224574 -0.5756232 -0.1430886 0.5451387 0.7230622 -0.1746675 -0.3335064 -0.0900912 1.9259537 0.1323185 -0.3021099 0.0251665 0.4031318 -0.0161797 -0.0652309 0.1332274 0.0139553 -0.123001 0.0055406 -0.020785 -0.0048857 -0.0197189 0.0063005 0.0167477 -0.0079473 0.0064117 -0.1277391 0.002734 -0.0209591 0.0536194 -0.1796804 -0.1906942 -0.237215 0.1307333 -0.1521391 -0.1525903 0.0814641 0.1524998 0.1619094 -0.070662 0.1469505 0.0947291 -0.1653207 0.0528359 -0.2653897 -0.0610897 -0.1610041 -0.0683329 -0.0207986 0.0709742 0.0612985 0.0283729 0.0682326 0.0270505 -0.0470414 0.0142575 -0.0306517 0.0958646 -0.0827647 -0.0025302 -0.1006813 -0.0005477 0.1056052 -0.0102069 -0.0686608 -0.0064869 0.0352196 0.053822 -0.0706051 0.0567398 -0.0913006 0.0025653 0.0557764 0.0343968 0.0275152 0.0781791 0.1454652 -0.0063333 0.0250566 0.0097892 0.1599079 0.0347221 0.0070882 0.0253893 -0.0386947 -0.0656217 -0.022806 0.0206849 -0.0334195 0.1864338 0.0116868 0.0562175 0.0180229 0.1019864 0.09236 0.087136 0.0170196 0.0100858 -0.0823066 -0.0033826 0.0224887 -0.0380046 0.1113216 0.0127809 0.0088622 -0.0563965 0.049627 0.1116462 0.0407015 -0.062664 0.0313008 0.0809646 0.1133834 -0.0195417 -0.020479 -0.0136381 0.0886204 -0.07181 -0.007189 -0.0366055 -0.0202745 0.0380484 -0.0079808 -0.0573003 -0.0088759 0.2061984 0.0266683 -0.0292517 0.0215477 0.0453904 unknown
polarizability: 197.7698536|-10.2628962|145.9066254|-16.5032482|-2.8089588|130.3973307 unknown
InChI: InChI=1S/C10H9ClN2O3S/c1-6(14)12-9(16)13(11)8(15)10(12,2)7-4-3-5-17-7/h3-5H,1-2H3
charge 0 multiplicity 1
26 atoms
Cl -2.944787 2.502124 0.686414
S  1.497768 -0.102644 1.611856
O  -0.177051 2.692331 -0.944726
O  -3.020518 -0.607282 0.884714
O  0.29971 -2.629134 -0.970268
N  -0.916999 -0.785063 -0.277133
N  -1.780096 1.2700 0.092766
C  0.073496 0.182075 -0.883729
C  -0.601454 1.578133 -0.59845
C  1.4140 0.118804 -0.186639
C  0.184167 0.03133 -2.419291
C  -2.0279 -0.127117 0.309693
C  -0.703898 -2.201324 -0.34661
C  2.677821 0.312469 -0.719298
C  3.73482 0.27514 0.261554
C  -1.703613 -3.09982 0.348172
C  3.281534 0.064721 1.552476
H  0.701607 -0.906851 -2.666916
H  -0.822564 0.019727 -2.871806
H  0.734918 0.894032 -2.829087
H  2.858608 0.470771 -1.784367
H  4.791747 0.395799 0.013372
H  -1.374331 -4.13941 0.204235
H  -2.721452 -2.96396 -0.054968
H  -1.768248 -2.868928 1.425538
H  3.848414 -0.021524 2.477701
