program: Gaussian 09
title: 000299306
version: EM64L-G09RevD.01
frameworkgroup: C1[X(C8H5Cl3N2O2S)]
method: RPBEPBE
basis: SDD
operation: Freq
keyword: #p
keyword: freq=noraman
keyword: PBEPBE/SDD
title: #p freq=noraman PBEPBE/SDD
converged: YES YES NO NO
title: Mulliken charges:
elementType: Cl Cl Cl S O O N N C C C C C C C C H H H H H
charge: 0.178121 0.224888 0.027106 0.346336 -0.157033 -0.165862 -0.485011 -0.503533 0.138513 -0.050932 0.272008 -0.695116 0.349481 -0.259843 -0.056205 -0.438577 0.246049 0.252891 0.251186 0.256015 0.269517
chargesum: 0.00000
title: Mulliken charges with hydrogens summed into heavy atoms:
elementType: Cl Cl Cl S O O N N C C C C C C C C
charge: 0.178121 0.224888 0.027106 0.346336 -0.157033 -0.165862 -0.485011 -0.503533 0.138513 -0.050932 0.272008 0.055010 0.349481 -0.003828 0.213313 -0.438577
polarizability: 2.20648313e+02 -5.04428777e+00 1.36283626e+02 -1.53811773e+01 -5.89660959e+00 1.36613607e+02
1716.lowfreq: -2.3151 0.0011 0.0016 0.0025 6.9493 8.7215 30.7042 34.2192 51.7231
frequency: 30.6301 34.2099 51.7097 84.3571 99.3510 137.6614 151.4667 154.4189 182.9777 197.2982 233.9561 247.6466 249.8385 287.1742 295.4982 303.1144 318.0508 344.9800 440.7362 457.9488 481.0417 539.0510 553.8583 614.5046 651.8916 661.8016 675.5169 688.0002 708.0837 751.2587 801.7147 836.7332 893.6076 939.2986 959.3200 1010.1942 1058.0096 1078.1667 1079.5084 1108.2037 1152.3862 1191.4046 1210.9670 1242.6505 1314.9337 1384.4195 1463.2718 1471.8807 1480.3672 1556.9024 1691.9826 1736.4453 3005.5828 3109.5859 3119.9855 3182.6188 3205.4986
redmass: 8.2444 14.5630 15.5754 18.9274 12.8267 14.2629 9.7405 10.4900 8.6333 13.0270 1.2345 2.7755 10.1483 4.9121 20.4915 10.1097 8.1412 9.4086 7.8025 6.4910 6.8805 6.8096 3.9489 11.7620 8.1810 11.3621 7.9175 6.7512 5.9791 5.0842 1.2979 4.3509 1.4510 4.1142 4.9920 2.6942 7.1984 1.6632 2.8203 3.4760 9.6118 3.5584 1.9655 3.5682 3.2206 1.1816 1.1122 1.1156 4.5585 6.1544 12.8513 12.8748 1.0344 1.1010 1.1016 1.0924 1.0995
irintensity: 0.4856 0.0075 0.8481 0.3012 2.7540 2.1276 1.1709 1.2945 0.7644 1.4942 0.1591 2.5398 1.5903 2.9050 1.8617 0.6227 2.3784 3.9818 23.1183 11.1915 10.8895 8.9171 0.4516 3.7445 123.7540 11.0637 12.6839 15.7946 0.2563 25.5254 34.6027 46.5380 1.1328 55.3837 36.5386 29.8763 53.9950 3.3678 30.3410 16.1712 17.6087 6.3240 10.6951 91.3023 21.9208 21.4158 20.9617 30.9680 117.5131 11.0352 502.1954 183.2619 4.8850 11.9072 3.2788 2.4304 0.2290
temp: 298.150 k
press: 1.00000 atm
elementType: 17 17 17 16 8 8 7 7 6 6 6 6 6 6 6 6 1 1 1 1 1
symmnumber: 1
zpe: 316494.0 jmol-1
zpe.correction: 0.120546 hartree
zpe.thermalcorrener: 0.136634 hartree
zpe.thermalcorrenthalpy: 0.137578 hartree
zpe.thermalcorrgfe: 0.074789 hartree
zpe.sumelectzpe: -2344.799454 hartree
zpe.sumelectthermal: -2344.783366 hartree
zpe.sumelectthermalent: -2344.782422 hartree
zpe.sumelectthermalfe: -2344.845211 hartree
dipole: -1.8247 0.9856 3.6602
dipole: 4.2069
quadrupole: -122.0895 -125.0130 -114.4753
quadrupole: -2.1844 1.2775 7.9215
quadrupole: -1.5636 -4.4871 6.0506 -2.1844 1.2775 7.9215
hfenergy: -2344.9199999 hartree
pointgroup: C01 [X(C8H5Cl3N2O2S1)]
dipole: -0.8370568 0.6330203 1.2798772 debye
dipolederiv: 0.0711483 0.0188191 0.0240244 -0.0573511 -0.6721031 0.2389881 0.0922047 0.1044098 -0.0069285 -0.5976164 0.2796521 0.1205616 0.7285124 -0.2505662 -0.0730109 0.2632919 -0.0614382 0.0570403 -0.6285056 -0.1086773 -0.2997575 -0.1356434 0.0007997 -0.0683197 -0.451627 -0.0817279 -0.3078742 -0.0823258 -0.038932 0.0267715 0.0422729 0.1681171 -0.0438732 0.0573543 -0.0550165 -0.2015502 -0.3816557 -0.0854657 0.1039596 -0.1483119 -0.7805565 0.4303763 0.1509994 0.332443 -0.5965779 -0.8940044 -0.1162333 0.3644971 -0.2041561 -0.3637202 0.1571279 0.4998209 0.1270193 -0.6198774 -1.0791794 0.2848974 0.1331492 0.1095507 0.5931 -0.2951771 0.0984066 -0.2849894 -0.3141305 0.1680903 -0.6501597 0.2400545 -0.7845055 -0.1725739 0.4307609 -0.0144935 0.5792303 -0.5957865 1.0580486 0.255538 0.0007861 0.1499424 -0.1069265 0.0958907 -0.0446495 -0.0343358 0.2614523 -0.5260962 -0.0226085 -0.0028226 -0.0859313 -0.2252473 0.0549571 0.1902682 0.0610036 0.2717096 0.5345296 0.103701 -0.4295384 0.1652098 0.7619377 -0.5392023 -0.3921702 -0.369174 0.781151 -0.1336468 -0.0034942 -0.0167157 0.0109787 0.0028323 -0.0638133 -0.0135236 0.0153883 -0.035584 1.4745764 -0.0961043 -0.573878 0.0157094 0.9444908 -0.3988706 -0.7028141 -0.432081 0.8958987 0.2906117 0.0332797 0.1862148 0.0702654 -0.0995854 0.0107898 -0.0702987 0.0113449 -0.0749958 -0.3074872 -0.0125528 -0.1603737 -0.0717041 -0.1024828 -0.0530231 -0.3732718 -0.0272196 -0.3511998 0.8555815 0.1848895 0.2407868 0.2030401 -0.1579832 0.1007043 0.6391752 0.1167481 0.6244754 -0.1008924 -0.0327735 -0.047239 -0.0215292 0.0873281 -0.022081 -0.0225304 -0.0105436 0.0766257 0.060221 0.074133 0.0007159 0.0858709 -0.0203343 -0.0183256 0.0143005 0.0080409 0.0610546 0.0829195 -0.0331249 0.0781751 -0.0446798 0.0400908 0.0737795 0.0622983 0.0332624 0.0211593 0.1318615 -0.0109162 -0.0327761 -0.0005584 0.1607431 -0.0131228 -0.0478148 -0.0312122 -0.0327377 0.0038216 -0.0238674 0.0434044 -0.0269819 0.1926398 -0.0045549 0.0650737 -0.0011523 0.0866757 unknown
polarizability: 222.1845661|-9.8108623|135.0996764|-5.6204672|-6.1254003|136.2613029 unknown
InChI: InChI=1S/C8H5Cl3N2O2S/c1-8(4-2-3-5(9)16-4)6(14)12(10)7(15)13(8)11/h2-3H,1H3
charge 0 multiplicity 1
21 atoms
Cl 0.942025 2.854307 -0.726229
Cl 3.407635 -2.143028 -0.363803
Cl -4.628784 -0.535343 -1.809265
S  -1.622657 -0.005158 -1.254377
O  0.817775 -1.906412 1.567511
O  3.180571 0.774432 -1.55329
N  1.100056 1.070158 -0.393097
N  2.215217 -0.833312 -0.03811
C  0.381136 0.449022 0.751723
C  -1.081878 0.268521 0.457193
C  1.137707 -0.957558 0.833743
C  0.640289 1.172347 2.097252
C  2.286838 0.423343 -0.772699
C  -2.146797 0.181836 1.341879
C  -3.415314 -0.091541 0.716947
C  -3.305247 -0.222932 -0.654901
H  1.723367 1.318104 2.249057
H  0.141656 2.155327 2.098193
H  0.252277 0.562708 2.929508
H  -2.037133 0.297142 2.422238
H  -4.358243 -0.184959 1.25783
