program: Gaussian 09
title: 000299320
version: EM64L-G09RevD.01
frameworkgroup: C1[X(C11H19Cl2N3O2)]
method: RPBEPBE
basis: SDD
operation: Freq
keyword: #p
keyword: freq=noraman
keyword: PBEPBE/SDD
title: #p freq=noraman PBEPBE/SDD
converged: YES YES NO NO
title: Mulliken charges:
elementType: Cl Cl O O N N N C C C C C C C C C C C H H H H H H H H H H H H H H H H H H H
charge: -0.074997 -0.078009 -0.217451 -0.256468 -0.190240 -0.418060 -0.106433 0.175855 -0.355792 0.155011 -0.397400 0.203866 -0.673522 -0.674938 -0.332152 -0.334374 -0.567181 -0.577492 0.248033 0.245555 0.246390 0.233390 0.325451 0.218523 0.233643 0.248391 0.218794 0.248675 0.231083 0.234168 0.235204 0.234344 0.230534 0.264657 0.266160 0.302280 0.254502
chargesum: 0.00000
title: Mulliken charges with hydrogens summed into heavy atoms:
elementType: Cl Cl O O N N N C C C C C C C C C C C
charge: -0.074997 -0.078009 -0.217451 -0.256468 -0.190240 -0.092609 -0.106433 0.175855 0.137796 0.155011 0.082380 0.203866 0.027035 0.023615 0.137220 0.130503 -0.036364 -0.020709
polarizability: 1.97767742e+02 6.35269902e+00 1.91295935e+02 -3.99091854e+00 -2.30296587e+00 1.15149106e+02
1716.lowfreq: -6.8371 -0.0007 0.0018 0.0027 1.5232 6.0002 14.1735 20.7221 24.2748
frequency: 13.6097 20.5754 24.1253 28.2825 45.7081 57.4262 82.8862 91.6880 103.1354 116.4677 136.1796 190.3421 195.4347 198.1845 204.5438 229.7314 248.5326 265.4133 285.0169 289.8789 303.5408 312.7956 366.4751 389.0257 437.8694 467.5776 469.1559 476.8712 577.8300 605.4429 620.3841 653.4917 663.7276 697.2887 711.5967 735.3306 761.6494 773.2006 782.9929 846.3274 884.2410 924.4704 936.5065 975.7029 993.8422 1002.6879 1005.4215 1024.2750 1032.7247 1048.3776 1051.0467 1103.7465 1114.9305 1137.6468 1171.8205 1174.5089 1201.4186 1230.7050 1235.6621 1244.7392 1260.2410 1270.7057 1286.5277 1307.7902 1326.4833 1329.0258 1341.0059 1355.2854 1363.4910 1369.9997 1374.8672 1376.7778 1385.3169 1400.9273 1447.7245 1448.9073 1455.2934 1457.7081 1462.9603 1465.0609 1469.3047 1472.3261 1477.4769 1484.5148 1650.1344 1707.2684 2947.8609 2952.9531 2970.7129 2989.8928 2991.8472 3020.1977 3035.5474 3043.1926 3045.9866 3053.5284 3053.8820 3089.2809 3092.0821 3093.4788 3102.7322 3107.4604 3137.0906 3142.4606 3605.3568
redmass: 7.7792 7.4408 6.3720 9.9747 4.0441 5.0267 2.3268 2.9235 3.3745 2.9105 6.7795 5.6169 4.4996 1.1017 3.0207 1.3037 2.6501 2.9486 2.6298 4.0409 4.7531 2.8015 4.4990 4.4592 3.6157 2.7244 2.0216 1.5162 4.0851 8.6647 3.3802 6.4294 5.8154 8.9713 6.0595 8.3527 1.2189 1.2064 1.1520 4.2688 3.1357 2.2608 1.5023 1.8879 1.5678 1.8459 1.3191 2.3667 3.0102 3.5783 3.7339 2.0729 1.5663 1.3309 4.4081 4.1107 2.1498 2.0977 1.3037 1.3022 2.0827 1.4824 1.1762 1.4322 1.4926 1.3216 1.6502 1.8739 1.3950 1.7787 1.6139 1.1933 1.3827 1.3527 1.0879 1.1118 1.0812 1.0461 1.0491 1.0854 1.0956 1.0903 1.0664 1.0651 10.6283 9.7894 1.0663 1.0642 1.0618 1.0348 1.0353 1.0600 1.0968 1.1005 1.0588 1.0915 1.0587 1.1009 1.1070 1.1003 1.1010 1.1004 1.1130 1.1127 1.0800
irintensity: 0.0886 0.0524 0.0406 0.6028 1.9072 1.0893 1.9263 1.7285 1.8217 0.2634 2.8352 2.7991 5.1395 0.5199 5.9706 0.8405 5.5532 1.4184 4.6558 5.8377 6.1664 4.2469 33.0192 13.9841 1.4673 15.0327 44.5295 81.9229 12.1638 13.6374 3.1271 92.8455 103.6126 8.0818 19.4664 14.2135 5.1766 8.8072 8.3239 2.2118 4.9305 0.7451 2.1851 10.5258 4.7203 2.6030 0.5352 8.1177 17.7742 10.8715 3.2013 109.5083 63.5653 1.2105 18.4884 13.1329 5.7319 29.5549 14.4623 26.6020 48.6237 5.5765 11.8010 90.7719 15.3421 14.3636 21.4318 70.8457 12.8249 48.0686 72.5824 19.7725 42.0443 56.3962 10.8969 15.6227 6.6573 5.8344 2.6535 9.4700 18.7961 13.7313 8.6422 25.5944 577.8078 187.9660 37.1186 49.1452 42.5626 15.8092 23.7047 23.7266 8.9405 14.9895 13.1174 27.0972 19.3349 7.0443 6.3653 36.4083 8.4369 20.2255 11.7507 20.9220 53.9771
temp: 298.150 k
press: 1.00000 atm
elementType: 17 17 8 8 7 7 7 6 6 6 6 6 6 6 6 6 6 6 1 1 1 1 1 1 1 1 1 1 1 1 1 1 1 1 1 1 1
symmnumber: 1
zpe: 784731.6 jmol-1
zpe.correction: 0.298888 hartree
zpe.thermalcorrener: 0.319868 hartree
zpe.thermalcorrenthalpy: 0.320812 hartree
zpe.thermalcorrgfe: 0.244251 hartree
zpe.sumelectzpe: -1664.004719 hartree
zpe.sumelectthermal: -1663.983739 hartree
zpe.sumelectthermalent: -1663.982795 hartree
zpe.sumelectthermalfe: -1664.059356 hartree
dipole: -5.6668 0.2496 0.9769
dipole: 5.7558
quadrupole: -109.1502 -155.2873 -118.9924
quadrupole: -6.2122 1.5378 1.7588
quadrupole: 18.6598 -27.4774 8.8176 -6.2122 1.5378 1.7588
hfenergy: -1664.303607 hartree
pointgroup: C01 [X(C11H19Cl2N3O2)]
dipole: 2.1966181 0.1722989 -0.5227085 debye
polarizability: 196.9010694|-5.0315826|189.7134903|-10.320935|10.8270046|117.5982225 unknown
InChI: InChI=1S/C11H19Cl2N3O2/c1-11(2)9(17)16(10(18)14-11)8-7-15(5-3-12)6-4-13/h14H,3-8H2,1-2H3
charge 0 multiplicity 1
37 atoms
Cl -4.576306 -3.451704 0.341139
Cl -3.83004 3.640823 0.833184
O  2.194016 -2.169701 -0.491507
O  1.046185 2.233893 0.717436
N  1.286221 -0.075984 0.153765
N  3.122189 1.226842 0.10346
N  -2.436007 -0.007664 -0.585126
C  3.622799 -0.112817 -0.287615
C  -0.126318 -0.426345 0.338892
C  2.309514 -0.945463 -0.236668
C  -1.00036 0.024161 -0.87121
C  1.764631 1.263679 0.365058
C  4.639922 -0.678371 0.733989
C  4.201136 -0.126335 -1.723369
C  -3.184812 -1.256832 -0.758933
C  -3.159376 1.270556 -0.517199
C  -3.60317 -1.841243 0.603831
C  -2.856192 2.012294 0.798424
H  -0.180572 -1.519669 0.483312
H  -0.492664 0.081607 1.247928
H  -0.717649 1.063672 -1.122992
H  -0.753833 -0.610638 -1.748318
H  3.70452 2.058344 0.182608
H  5.583468 -0.104503 0.694939
H  4.239206 -0.629148 1.761071
H  4.85796 -1.732454 0.491602
H  5.145514 0.446091 -1.763247
H  4.406947 -1.166875 -2.02698
H  3.490037 0.316041 -2.442175
H  -4.091392 -1.101342 -1.378258
H  -2.554131 -1.995483 -1.288917
H  -2.897598 1.934056 -1.36945
H  -4.245081 1.074125 -0.579158
H  -4.284811 -1.174594 1.15385
H  -2.736269 -2.111231 1.225126
H  -1.797749 2.302371 0.89137
H  -3.188832 1.442644 1.679437
