program: Gaussian 09
title: 000299309
version: EM64L-G09RevD.01
frameworkgroup: C1[X(C12H11ClN2O3S)]
method: RPBEPBE
basis: SDD
operation: Freq
keyword: #p
keyword: freq=noraman
keyword: PBEPBE/SDD
title: #p freq=noraman PBEPBE/SDD
converged: YES YES NO NO
title: Mulliken charges:
elementType: Cl S O O O N N C C C C C C C C C C C C H H H H H H H H H H H
charge: 0.034063 0.390876 -0.247924 -0.219990 -0.284893 -0.183970 -0.047675 -0.513944 0.308521 -0.062444 -0.269410 0.085631 -0.330834 0.177667 -0.255682 -0.227541 -0.076291 -0.447459 -0.677804 0.269114 0.272440 0.289294 0.265451 0.330788 0.235489 0.235324 0.276139 0.214641 0.229975 0.230451
chargesum: 0.00000
title: Mulliken charges with hydrogens summed into heavy atoms:
elementType: Cl S O O O N N C C C C C C C C C C C C
charge: 0.034063 0.390876 -0.247924 -0.219990 -0.284893 -0.183970 -0.047675 0.027610 0.308521 0.226850 -0.269410 0.085631 -0.065384 0.177667 0.075105 0.243272 0.199847 -0.447459 -0.002738
polarizability: 2.59232937e+02 -1.40973990e+01 1.78522269e+02 4.60461953e+00 -2.20331003e+01 1.36307478e+02
1716.lowfreq: -6.5466 -1.3699 -0.0022 -0.0018 -0.0006 5.4271 16.3494 32.5412 53.1513
frequency: 16.2909 32.5326 53.1407 62.9066 75.8224 97.9489 108.7649 113.6563 142.3232 150.6918 201.7319 229.8396 244.9141 256.9361 272.6527 290.9145 318.7734 351.7901 385.4351 413.5909 443.6712 455.6569 505.2877 526.9167 536.2842 561.0417 577.1052 586.2591 641.1413 677.6518 686.1140 703.4474 729.5733 750.2451 786.5481 797.0398 804.8041 829.9073 861.1643 906.2686 935.8052 948.4557 951.9683 962.0998 986.4416 1020.8273 1059.5013 1093.4419 1106.9865 1134.7723 1150.5243 1166.2755 1205.0771 1227.2917 1246.6761 1269.3670 1278.8239 1316.3058 1330.1755 1346.9424 1361.2733 1400.3033 1433.8577 1452.9170 1461.9613 1463.0840 1471.8039 1487.0708 1502.0118 1521.9659 1564.9094 1593.8491 1630.2182 2996.7287 3020.1797 3041.0206 3078.0209 3093.7532 3109.7961 3116.9860 3129.6258 3169.3087 3202.9053 3217.8700
redmass: 7.7185 5.2084 2.9443 4.6274 6.3451 14.4510 7.0202 4.6282 4.2822 3.6027 9.3777 3.4399 2.0570 4.2890 11.6434 4.5876 4.4765 4.3807 6.4396 4.0358 4.1624 5.2547 6.8877 6.3500 5.9103 3.9830 3.9160 6.8310 9.0487 7.7907 4.1723 7.5450 6.2884 8.5334 1.7261 1.1016 3.1944 1.3543 4.1656 4.0298 3.6480 1.3652 1.5552 5.3037 2.6648 2.3297 2.0234 1.6697 2.2854 1.4601 4.2164 2.1627 1.7882 1.4304 1.1339 2.7375 3.5505 1.5270 2.7184 1.3456 1.7748 1.2674 2.2337 7.3013 1.1944 1.0403 1.1011 1.0853 7.2789 5.7371 8.1705 6.9303 7.7170 1.0359 1.0585 1.0599 1.1058 1.0984 1.1033 1.1039 1.0975 1.0934 1.0974 1.0979
irintensity: 0.8376 1.8547 1.6527 4.1631 3.7488 2.2848 0.2937 6.8053 18.2721 1.4249 0.9217 0.1406 0.5799 1.7048 2.2492 0.4424 5.6333 9.0670 1.2921 1.9933 3.3989 11.5769 40.6237 21.1204 6.7160 6.6616 12.7538 11.9730 7.4415 3.3699 3.7475 2.1057 0.5790 23.8724 60.9209 3.3691 15.7059 59.7421 9.4915 26.1597 38.0473 13.2118 2.8016 79.6468 18.2967 86.5139 12.9146 30.9628 2.3938 4.8977 65.3794 4.3663 16.9512 32.0403 0.1486 430.1188 26.9712 1.5510 37.2676 88.8596 54.6219 41.1903 262.8434 327.6950 13.8542 13.0500 2.4993 7.1527 54.9725 28.3587 175.5644 211.2877 635.6036 24.5701 11.0141 21.3490 2.0820 25.7259 43.5811 0.8724 58.7350 0.8779 2.6932 0.3689
temp: 298.150 k
press: 1.00000 atm
elementType: 17 16 8 8 8 7 7 6 6 6 6 6 6 6 6 6 6 6 6 1 1 1 1 1 1 1 1 1 1 1
symmnumber: 1
zpe: 558931.0 jmol-1
zpe.correction: 0.212886 hartree
zpe.thermalcorrener: 0.231035 hartree
zpe.thermalcorrenthalpy: 0.231980 hartree
zpe.thermalcorrgfe: 0.163937 hartree
zpe.sumelectzpe: -1655.774183 hartree
zpe.sumelectthermal: -1655.756034 hartree
zpe.sumelectthermalent: -1655.755089 hartree
zpe.sumelectthermalfe: -1655.823132 hartree
dipole: -2.1333 -0.2033 -0.3114
dipole: 2.1655
quadrupole: -112.9628 -119.5600 -129.9253
quadrupole: -3.3549 8.3162 4.9447
quadrupole: 7.8532 1.2560 -9.1092 -3.3549 8.3162 4.9447
hfenergy: -1655.987069 hartree
pointgroup: C01 [X(C12H11Cl1N2O3S1)]
dipole: 0.8482954 -0.0111677 -0.0783681 debye
polarizability: 257.2208367|-15.5594405|187.8054836|13.2631392|-8.4434098|129.0363644 unknown
InChI: InChI=1S/C12H11ClN2O3S/c1-2-18-11-5-6-15(12(17)14-11)7-8(16)9-3-4-10(13)19-9/h3-6H,2,7H2,1H3
charge 0 multiplicity 1
30 atoms
Cl -5.614521 1.384805 -1.93099
S  -3.909428 -0.955921 -0.834343
O  4.208905 -0.233857 -0.606629
O  -1.930483 -2.883357 0.471309
O  0.421605 1.196532 1.777374
N  0.633825 -1.076006 1.21288
N  2.342299 0.525338 0.597093
C  -0.656156 -1.367721 1.882141
C  -1.764124 -1.678548 0.847486
C  1.33337 -2.089246 0.583502
C  -2.562964 -0.573718 0.334126
C  1.120978 0.300816 1.219154
C  2.538584 -1.838143 -0.043823
C  3.003399 -0.477357 0.005625
C  -2.472923 0.802929 0.5812
C  4.721233 1.174821 -0.576607
C  -3.443503 1.583139 -0.123951
C  -4.276648 0.796783 -0.910914
C  6.053152 1.161417 -1.317371
H  -0.54496 -2.267011 2.511122
H  -0.893478 -0.495864 2.509712
H  0.87201 -3.080695 0.604843
H  3.108652 -2.619108 -0.545254
H  -1.697553 1.235438 1.224334
H  3.967174 1.824978 -1.054037
H  4.816861 1.484213 0.479067
H  -3.522784 2.669412 -0.059254
H  6.479168 2.181114 -1.329078
H  6.775367 0.489415 -0.823061
H  5.923246 0.827702 -2.36106
