program: Gaussian 09
title: 000299331
version: EM64L-G09RevD.01
frameworkgroup: C1[X(C18H16N2O4)]
method: RPBEPBE
basis: SDD
operation: Freq
keyword: #p
keyword: freq=noraman
keyword: PBEPBE/SDD
title: #p freq=noraman PBEPBE/SDD
converged: YES YES NO NO
title: Mulliken charges:
elementType: O O O O N N C C C C C C C C C C C C C C C C C C H H H H H H H H H H H H H H H H
charge: -0.289365 -0.236198 -0.222702 -0.172293 -0.036442 0.000784 -0.695772 0.645045 0.058745 0.197022 0.415883 -0.650132 -0.550774 0.319734 0.310549 0.033611 -0.365972 -0.350521 -0.414225 -0.386502 -0.260136 -0.227105 -0.534336 -0.503445 0.230555 0.259628 0.279777 0.280694 0.249903 0.235555 0.238648 0.240450 0.237722 0.234570 0.234884 0.229559 0.246171 0.257364 0.216362 0.242704
chargesum: 0.00000
title: Mulliken charges with hydrogens summed into heavy atoms:
elementType: O O O O N N C C C C C C C C C C C C C C C C C C
charge: -0.289365 -0.236198 -0.222702 -0.172293 -0.036442 0.000784 -0.205589 0.645045 0.058745 0.197022 0.415883 -0.370354 -0.270080 0.319734 0.310549 0.033611 -0.116069 -0.114966 -0.175577 -0.146052 -0.022414 0.007465 0.176279 0.212985
polarizability: 2.63733480e+02 1.64278178e+01 2.63829361e+02 6.18122411e+00 -1.05629808e+01 1.65348874e+02
1716.lowfreq: -12.4371 -5.8493 -2.5203 -0.0006 -0.0004 0.0005 11.7385 21.7216 23.2310
frequency: 11.4575 21.5963 23.0376 35.6747 50.3178 58.2099 89.1383 110.0769 129.1123 144.9263 166.2273 174.2035 177.0351 192.2688 215.6288 251.5068 268.1117 288.5388 302.5275 317.7869 367.8140 392.3662 405.3125 421.8984 434.4730 470.3285 477.0359 491.9503 498.3740 511.3228 529.0088 574.3969 575.8192 633.1916 634.8226 676.1013 696.5727 709.7577 723.7988 736.6408 759.6339 764.4466 787.8907 812.4216 845.0028 862.9224 873.1726 884.7478 897.4246 900.3730 927.4355 941.9843 954.0873 961.8531 974.4891 1000.3803 1019.2667 1030.6765 1044.1459 1067.4765 1104.1513 1110.7780 1129.0491 1148.9976 1150.3845 1157.7449 1168.3484 1183.8703 1202.1666 1223.3371 1227.0302 1234.1094 1245.0941 1273.4008 1275.7549 1308.1554 1353.3013 1363.1156 1365.2640 1384.6184 1407.1759 1409.4052 1422.5703 1425.7936 1439.6757 1445.0421 1453.0332 1465.7791 1466.6056 1468.7359 1470.9406 1487.9934 1500.7579 1552.8858 1575.2590 1577.5561 1611.6273 1627.8650 2970.0827 2992.1717 3009.1227 3062.5171 3066.7106 3106.3785 3127.0253 3131.1203 3131.5742 3141.1427 3141.3327 3151.7046 3155.9730 3157.1038 3164.9993 3171.7875
redmass: 5.7223 5.1820 1.7847 4.9560 6.8437 3.8238 3.5274 3.9128 3.0130 5.2878 4.9933 4.9579 3.9307 2.3223 3.0152 3.2862 1.9416 3.3268 4.2165 5.3188 4.9149 5.7330 3.5695 5.4092 2.8983 3.7515 4.8551 6.2619 5.9761 6.1275 5.5755 3.7811 5.0710 5.0292 3.9236 5.6055 7.1566 7.9088 4.7561 3.2942 1.5595 3.7458 6.2022 2.7928 1.3404 6.0992 3.4239 1.6428 1.9186 1.6531 2.4658 5.9323 7.3147 1.3749 1.4162 1.3477 3.4542 4.7271 2.6499 2.3822 1.2359 1.2578 1.9613 1.4248 1.5500 1.4279 1.2418 1.1804 3.6591 1.9599 1.8384 3.0693 1.7797 1.6801 3.8705 1.7147 3.1642 8.0659 4.4899 6.2907 2.3311 1.9949 4.6849 1.3346 2.0583 1.3833 1.0984 1.1968 1.0552 1.0740 1.1197 2.2917 2.9695 6.9665 7.6677 6.0333 6.4629 6.4385 1.0323 1.0328 1.0594 1.1045 1.1019 1.0991 1.0867 1.1004 1.0869 1.0896 1.1058 1.0912 1.0969 1.0969 1.0923 1.0990
irintensity: 1.7062 0.5743 6.0438 1.1182 0.5538 0.2206 5.4179 2.0858 2.1972 3.3556 2.0875 0.9159 1.7319 1.7791 2.3395 4.8878 0.4204 2.8604 4.6543 1.5507 2.1889 0.9619 2.2600 0.8144 3.2554 0.8358 13.3173 2.8488 0.9290 2.1296 10.0889 6.8292 9.1287 1.0505 14.7623 5.3570 6.8740 15.1852 0.7844 22.7506 37.6113 11.1036 2.6625 7.6274 63.0069 16.0051 19.6053 9.9334 9.5477 5.5043 0.6736 47.2458 9.0918 1.3585 2.4010 0.0500 4.3238 62.3273 8.3234 2.4806 2.2338 0.1032 37.3389 2.7878 18.2225 23.1245 11.0583 9.8697 165.6276 32.6148 4.3020 157.3402 0.4875 14.5238 200.6552 20.0286 49.8927 46.9331 32.4672 65.9096 2.2192 4.9769 8.4123 21.6709 2.7824 8.1472 45.8003 104.6380 9.3556 38.7958 52.7533 110.4688 15.8262 25.8201 9.3942 7.2844 17.2868 8.7228 43.9780 62.3876 15.7342 35.3755 4.8523 34.3945 1.9593 21.6996 2.4952 6.0871 12.4552 1.7588 23.4409 48.5580 1.8578 14.2005
temp: 298.150 k
press: 1.00000 atm
elementType: 8 8 8 8 7 7 6 6 6 6 6 6 6 6 6 6 6 6 6 6 6 6 6 6 1 1 1 1 1 1 1 1 1 1 1 1 1 1 1 1
symmnumber: 1
zpe: 797887.2 jmol-1
zpe.correction: 0.303899 hartree
zpe.thermalcorrener: 0.325439 hartree
zpe.thermalcorrenthalpy: 0.326383 hartree
zpe.thermalcorrgfe: 0.249784 hartree
zpe.sumelectzpe: -1104.092932 hartree
zpe.sumelectthermal: -1104.071392 hartree
zpe.sumelectthermalent: -1104.070448 hartree
zpe.sumelectthermalfe: -1104.147047 hartree
dipole: 5.5370 4.7604 3.1157
dipole: 7.9390
quadrupole: -148.6004 -132.8634 -132.0187
quadrupole: -18.7538 0.3487 2.8200
quadrupole: -10.7729 4.9641 5.8088 -18.7538 0.3487 2.8200
hfenergy: -1104.396831 hartree
pointgroup: C01 [X(C18H16N2O4)]
dipole: 1.5423169 -1.6317306 -2.1712991 debye
polarizability: 253.7882026|-7.6155212|261.1780939|-20.9085131|32.1208678|177.9454191 unknown
InChI: InChI=1S/C18H16N2O4/c1-23-17-11-12(10-16(20(21)22)18(17)24-2)9-15-14-6-4-3-5-13(14)7-8-19-15/h3-8,10-11H,9H2,1-2H3
charge 0 multiplicity 1
40 atoms
O  -3.097183 -1.733556 -0.741543
O  -4.178296 0.705144 0.179493
O  -1.843108 3.22242 2.346833
O  -3.984389 2.44144 2.246326
N  2.139822 -2.635665 0.585729
N  -2.718701 2.304505 2.062377
C  1.03715 -1.014076 2.028663
C  -0.333081 -0.553056 1.531202
C  2.011955 -1.325097 0.898147
C  2.732952 -0.282785 0.196599
C  3.641082 -0.680068 -0.860664
C  -0.914079 0.638072 1.989866
C  -1.051946 -1.35218 0.604235
C  -2.193319 1.030675 1.527967
C  -2.32417 -0.965706 0.140983
C  -2.929155 0.262064 0.58245
C  2.588914 1.112707 0.493216
C  3.762591 -2.076891 -1.158044
C  4.377305 0.323433 -1.57092
C  3.005913 -2.995245 -0.433253
C  3.315824 2.070913 -0.217938
C  4.2181 1.674176 -1.25522
C  -2.547632 -3.021462 -1.181645
C  -4.56765 0.626735 -1.249413
H  1.457355 -0.254738 2.712143
H  0.924044 -1.950484 2.603898
H  -0.402125 1.287974 2.705101
H  -0.59574 -2.288096 0.266329
H  1.89536 1.434294 1.275529
H  4.441653 -2.41454 -1.948455
H  5.065339 0.014283 -2.366525
H  3.067855 -4.069902 -0.634866
H  3.194676 3.133988 0.015732
H  4.78185 2.438092 -1.801791
H  -2.373186 -3.693996 -0.320758
H  -1.605559 -2.883809 -1.745678
H  -3.318454 -3.448932 -1.839022
H  -4.804502 -0.408725 -1.534407
H  -3.76036 1.02164 -1.893303
H  -5.455807 1.272355 -1.31587
