program: Gaussian 09
title: 000299292
version: EM64L-G09RevD.01
frameworkgroup: C1[X(C13H9ClO4)]
method: RPBEPBE
basis: SDD
operation: Freq
keyword: #p
keyword: freq=noraman
keyword: PBEPBE/SDD
title: #p freq=noraman PBEPBE/SDD
converged: NO YES NO NO
title: Mulliken charges:
elementType: Cl O O O O C C C C C C C C C C C C C H H H H H H H H H
charge: -0.041798 -0.212548 -0.230920 -0.161895 -0.154006 -0.330895 0.311279 -0.390931 0.169439 -0.054027 0.182719 0.175966 -0.690654 0.179079 -0.359692 -0.324744 -0.133499 -0.186777 0.276793 0.217074 0.252307 0.239929 0.231088 0.225743 0.271184 0.273285 0.266499
chargesum: 0.00000
title: Mulliken charges with hydrogens summed into heavy atoms:
elementType: Cl O O O O C C C C C C C C C C C C C
charge: -0.041798 -0.212548 -0.230920 -0.161895 -0.154006 -0.054101 0.311279 0.078450 0.169439 -0.054027 0.182719 0.175966 0.006105 0.179079 -0.088509 -0.051458 -0.133499 0.079722
polarizability: 2.41763383e+02 -1.09180741e+01 1.71446361e+02 4.06641157e+00 1.30619227e+01 8.44622128e+01
1716.lowfreq: -8.0454 0.0019 0.0021 0.0022 0.9107 6.7159 31.9135 59.0910 73.0290
frequency: 31.7986 59.0802 73.0203 98.9847 112.9518 130.2621 155.9049 187.4921 190.0885 245.9091 269.3562 295.3618 321.6432 346.8116 353.0094 400.5643 413.0000 428.7729 456.2584 478.4848 536.4833 559.2474 610.1699 622.5567 649.1228 681.1286 697.1593 710.3828 741.3605 769.1691 780.7183 810.8274 815.9359 845.0957 865.1929 875.6869 896.4350 951.7240 963.0728 1020.0629 1045.9832 1056.6206 1057.2504 1102.1193 1121.5331 1148.9474 1176.3656 1210.0779 1246.5249 1256.6806 1266.3356 1287.4466 1339.0489 1369.1986 1404.2548 1407.0198 1430.9681 1460.3462 1465.1350 1479.1392 1484.4719 1577.7546 1582.5288 1618.7749 1679.9011 1716.4472 2987.8546 2993.0619 3007.9215 3060.1209 3087.2254 3088.9542 3171.8506 3173.9232 3189.9140
redmass: 4.8037 12.8153 3.6309 3.8678 5.2347 10.9560 10.0205 2.9404 1.6195 7.2838 2.3493 5.4066 5.9361 11.4947 6.2358 9.0352 8.1568 3.0899 5.3323 9.2883 7.3530 4.8102 5.9044 8.2611 5.4226 6.8914 6.8962 9.2665 4.6698 2.1434 4.0167 2.8732 1.4417 5.9076 3.2385 1.5028 5.7048 1.3371 4.8652 1.9490 2.3224 3.0950 2.1637 2.9425 2.3100 2.2516 2.2253 1.3143 2.0380 1.3024 1.6926 2.1897 1.4480 3.2149 1.2382 4.8011 3.3142 2.2462 1.5187 1.0448 1.0485 8.5247 9.4619 8.5048 12.4028 12.7157 1.0368 1.0764 1.0666 1.1013 1.1003 1.1005 1.0893 1.0936 1.0981
irintensity: 1.5216 1.3435 0.4002 1.0609 2.0727 1.0356 0.0149 4.3447 0.5553 1.4678 2.3102 0.1004 1.0625 6.6118 2.7423 3.1074 6.3973 11.9057 0.2894 2.4346 18.2864 2.2262 20.8455 2.8847 19.0063 14.2161 35.2370 3.3965 0.7928 3.8139 4.2427 5.6748 51.8380 111.8791 18.3780 19.2282 260.5773 0.7873 206.4247 20.1587 47.5888 7.5497 5.5973 53.7484 34.5906 2.1494 9.9465 16.5244 0.9192 5.3065 4.4614 72.5640 6.0569 36.0296 15.3054 16.5952 25.4483 39.7828 27.0587 7.5329 12.9133 37.1836 20.6167 4.2522 271.5189 494.3145 14.4863 4.5718 20.5188 1.0760 24.9402 40.7090 0.0587 0.1561 0.4546
temp: 298.150 k
press: 1.00000 atm
elementType: 17 8 8 8 8 6 6 6 6 6 6 6 6 6 6 6 6 6 1 1 1 1 1 1 1 1 1
symmnumber: 1
zpe: 497658.4 jmol-1
zpe.correction: 0.189548 hartree
zpe.thermalcorrener: 0.204918 hartree
zpe.thermalcorrenthalpy: 0.205862 hartree
zpe.thermalcorrgfe: 0.146000 hartree
zpe.sumelectzpe: -1260.468308 hartree
zpe.sumelectthermal: -1260.452938 hartree
zpe.sumelectthermalent: -1260.451994 hartree
zpe.sumelectthermalfe: -1260.511857 hartree
dipole: 5.7632 -1.8141 0.9962
dipole: 6.1235
quadrupole: -137.4596 -112.1920 -109.6027
quadrupole: 11.7914 -3.6063 -2.6696
quadrupole: -17.7082 7.5594 10.1488 11.7914 -3.6063 -2.6696
hfenergy: -1260.6578565 hartree
pointgroup: C01 [X(C13H9Cl1O4)]
dipole: -2.1880478 0.9293126 0.3910883 debye
polarizability: 238.9467685|-17.5254873|175.026468|-3.9364512|-10.2319612|83.6987205 unknown
InChI: InChI=1S/C13H9ClO4/c1-2-7-10-8-5-6(14)3-4-9(8)17-11(10)13(16)18-12(7)15/h3-5,7H,2H2,1H3
charge 0 multiplicity 1
27 atoms
Cl -4.79919 1.797691 -0.266651
O  -0.261704 -2.063016 0.1380
O  3.121457 -0.532921 -0.363438
O  3.669417 1.588979 -1.018591
O  2.638028 -2.742843 0.151775
C  1.312695 1.29157 -0.437192
C  0.367173 0.144996 -0.241803
C  1.285311 2.320647 0.754351
C  -1.079158 0.103154 -0.160978
C  0.804874 -1.157873 -0.062732
C  -1.42075 -1.266279 0.071384
C  2.764429 0.829568 -0.650583
C  1.693128 1.717042 2.112803
C  2.18617 -1.611548 -0.058754
C  -2.114355 1.068527 -0.269006
C  -2.737714 -1.728075 0.20414
C  -3.431057 0.60371 -0.135431
C  -3.758572 -0.760766 0.097895
H  1.044137 1.858058 -1.3511
H  0.263202 2.739353 0.817083
H  1.965475 3.148399 0.483443
H  2.73085 1.337323 2.093846
H  1.638095 2.488218 2.900872
H  1.027568 0.88654 2.409846
H  -1.9074 2.125678 -0.45412
H  -2.963618 -2.782416 0.379945
H  -4.807392 -1.054616 0.192497
