program: Gaussian 09
title: 000299283
version: EM64L-G09RevD.01
frameworkgroup: C1[X(C15H10O2)]
method: RPBEPBE
basis: SDD
operation: Freq
keyword: #pfreq=noraman
keyword: PBEPBE/SDD
title: #p freq=noraman PBEPBE/SDD
converged: YES YES NO NO
title: Mulliken charges:
elementType: O O C C C C C C C C C C C C C C C H H H H H H H H H H
charge: -0.440068 -0.247701 0.395172 0.245153 -0.508643 -0.392918 -0.335345 -0.206843 0.374164 -0.396469 -0.395024 -0.221252 -0.220896 -0.085335 0.108360 -0.241192 -0.063339 0.288166 0.253283 0.278344 0.235370 0.247101 0.250548 0.230378 0.231328 0.232210 0.385448
chargesum: 0.00000
title: Mulliken charges with hydrogens summed into heavy atoms:
elementType: O O C C C C C C C C C C C C C C C
charge: -0.054620 -0.247701 0.395172 0.245153 -0.220476 -0.139635 -0.057002 0.028527 0.374164 -0.149367 -0.144477 0.009126 0.010432 -0.085335 0.108360 -0.008982 -0.063339
polarizability: 3.62869686e+02 -1.60913568e+01 1.76272803e+02 1.30657567e-03 -4.09308248e-04 6.33360569e+01
1716.lowfreq: -5.8498 -0.0010 0.0009 0.0013 3.3846 10.9272 23.2621 30.4694 43.4749
frequency: 23.1653 30.4229 43.4491 68.4482 113.2320 135.8813 164.5737 209.7476 237.5093 281.3948 364.9144 401.1863 402.1590 422.5587 443.0767 496.4731 523.8119 536.8195 549.7704 561.0926 595.0873 613.4038 617.7415 680.1517 693.8242 696.0152 731.9455 760.1893 775.1335 827.2476 853.3002 886.5463 928.4033 942.8322 955.3196 981.1571 985.5028 985.8121 999.4270 1002.1924 1023.6354 1038.7814 1079.4862 1092.6062 1121.2238 1164.1040 1173.8174 1184.5844 1188.6207 1286.4297 1312.3815 1314.8669 1336.1519 1368.6685 1374.7035 1429.6667 1433.6775 1465.5514 1491.1486 1572.5762 1575.6608 1601.9706 1614.2494 1645.2243 2241.5732 3129.1829 3137.4725 3141.3385 3150.3984 3159.1397 3161.9630 3165.9321 3170.5647 3183.5785 3532.0375
redmass: 4.0689 6.0306 6.9134 7.3353 6.1652 5.0726 4.5040 6.1095 6.9229 5.0151 7.6379 4.2319 2.8896 3.3340 9.0516 6.8671 2.9984 7.9375 6.8548 3.0120 4.7089 1.5731 6.6194 6.4328 2.2326 1.8301 4.0384 6.3660 1.7650 1.5817 1.2477 5.8157 1.4400 1.4242 1.4934 1.3816 6.1952 6.2617 1.3221 1.3610 2.3228 2.8384 1.6049 1.7566 1.7763 2.2387 1.0558 1.1148 1.1385 1.5638 1.4674 1.8261 2.9323 5.3381 7.1608 3.7435 2.4161 2.3196 2.9303 5.6626 5.8208 6.0111 6.3005 8.7378 11.9954 1.0848 1.0880 1.0873 1.0929 1.0970 1.0948 1.0928 1.1017 1.0968 1.0642
irintensity: 0.0557 0.6431 2.4982 0.0022 0.1257 0.0501 0.5418 0.3128 0.2388 0.0130 9.7998 0.2279 0.0260 8.3191 6.6163 9.1897 0.3416 19.3811 1.1793 40.7387 59.6280 116.4470 0.2102 5.3305 2.4089 48.5765 67.7804 0.0915 67.3461 30.4585 0.0005 50.6836 6.0286 2.2639 16.8130 0.0015 1.4968 0.5189 0.2070 0.5412 43.3661 264.6706 8.4334 10.9824 58.3916 77.0574 0.0016 1.8030 0.0579 31.7115 5.5235 28.7373 50.1775 0.7596 17.1543 31.7169 8.0955 1.7991 64.2782 1.7451 31.2512 8.9061 33.5805 221.7714 15.9680 2.6301 2.9805 9.6003 17.8664 28.3771 12.1222 2.2182 24.5414 4.6998 51.6227
temp: 298.150 k
press: 1.00000 atm
elementType: 8 8 6 6 6 6 6 6 6 6 6 6 6 6 6 6 6 1 1 1 1 1 1 1 1 1 1
symmnumber: 1
zpe: 529849.3 jmol-1
zpe.correction: 0.201809 hartree
zpe.thermalcorrener: 0.215997 hartree
zpe.thermalcorrenthalpy: 0.216941 hartree
zpe.thermalcorrgfe: 0.158060 hartree
zpe.sumelectzpe: -726.859529 hartree
zpe.sumelectthermal: -726.845341 hartree
zpe.sumelectthermalent: -726.844397 hartree
zpe.sumelectthermalfe: -726.903278 hartree
dipole: 0.6437 1.9245 0.0001
dipole: 2.0293
quadrupole: -70.8793 -89.9747 -103.6583
quadrupole: -4.1229 -0.0032 -0.0002
quadrupole: 17.2915 -1.8039 -15.4875 -4.1229 -0.0032 -0.0002
hfenergy: -727.0613378 hartree
pointgroup: C01 [X(C15H10O2)]
dipole: -0.2474596 0.7590566 -0.0000489 debye
polarizability: 363.1052528|14.6601605|176.0372364|0.0013097|0.0003993|63.3360569 unknown
InChI: InChI=1S/C15H10O2/c16-15(17)14-8-4-7-13(11-14)10-9-12-5-2-1-3-6-12/h1-8,11,16H
charge 0 multiplicity 1
27 atoms
O  5.626275 -0.907679 -0.000985
O  3.931082 -2.493509 -0.000496
C  1.032591 0.706096 0.000113
C  3.352653 -0.116482 0.000364
C  1.961352 -0.370905 0.000277
C  1.535707 2.043212 0.000005
C  3.840957 1.216265 0.000227
C  2.923796 2.288921 0.000069
C  -3.005876 -0.019758 -0.000075
C  -3.942781 1.056681 -0.000229
C  -3.497003 -1.359715 0.00001
C  -5.327814 0.796281 -0.000295
C  -4.883667 -1.610738 -0.000056
C  -0.376799 0.456637 0.00005
C  4.272896 -1.286412 0.000627
C  -5.80497 -0.536248 -0.000209
C  -1.596982 0.23757 -0.000008
H  1.609881 -1.407343 0.00038
H  0.825286 2.876479 -0.000127
H  4.919755 1.392393 0.000286
H  3.291918 3.320187 -0.000009
H  -3.571209 2.086785 -0.000295
H  -2.782043 -2.189084 0.000128
H  -6.037067 1.631304 -0.000413
H  -5.24788 -2.643946 0.000011
H  -6.882283 -0.734897 -0.00026
H  6.185525 -1.730298 -0.001891
