program: Gaussian 09
title: 000299393
version: EM64L-G09RevD.01
frameworkgroup: C1[X(C16H11F12NO2)]
method: RPBEPBE
basis: SDD
operation: Freq
keyword: #p
keyword: freq=noraman
keyword: PBEPBE/SDD
title: #p freq=noraman PBEPBE/SDD
converged: YES YES NO NO
title: Mulliken charges:
elementType: F F F F F F F F F F F F O O N C C C C C C C C C C C C C C C C H H H H H H H H H H H
charge: -0.147773 -0.136173 -0.118538 -0.153011 -0.135498 -0.111677 -0.145978 -0.117911 -0.169506 -0.148800 -0.157953 -0.119332 -0.539864 -0.407951 -0.226737 0.318304 0.204305 -0.702276 -0.115865 0.061692 0.183139 0.190482 0.357316 0.350189 0.373685 0.370499 -0.653420 -0.374683 -0.357666 -0.268594 -0.228162 0.277152 0.316467 0.262461 0.251341 0.241948 0.255454 0.246136 0.417139 0.400185 0.228826 0.230649
chargesum: 0.00000
title: Mulliken charges with hydrogens summed into heavy atoms:
elementType: F F F F F F F F F F F F O O N C C C C C C C C C C C C C C C C
charge: -0.147773 -0.136173 -0.118538 -0.153011 -0.135498 -0.111677 -0.145978 -0.117911 -0.169506 -0.148800 -0.157953 -0.119332 -0.122725 -0.007766 -0.226737 0.318304 0.204305 -0.108657 -0.115865 0.061692 0.183139 0.190482 0.357316 0.350189 0.373685 0.370499 0.102330 -0.119229 -0.111530 -0.039768 0.002487
polarizability: 2.36300088e+02 -2.22535290e+01 2.21508475e+02 -1.53539439e+01 -9.34081231e+00 1.29316367e+02
1716.lowfreq: -0.0007 -0.0006 -0.0004 2.5618 4.2425 7.2508 24.7387 34.5396 38.4667
frequency: 24.6260 34.4600 38.4553 42.3446 58.9284 66.0404 72.0223 78.8053 92.2281 117.9139 128.2639 144.5448 151.3472 156.1074 161.7381 175.6022 182.3525 192.9675 217.0008 236.5641 246.8504 253.5056 266.1266 271.8148 289.8718 296.6280 301.8412 306.7800 314.5118 322.8775 327.6420 343.4270 380.9332 403.2603 409.7013 431.4180 437.7919 452.8622 458.0597 463.4442 469.5051 475.0799 484.0553 488.0979 529.3435 546.8974 553.9341 564.7470 576.2043 587.3277 613.3527 625.0684 629.4167 646.5646 660.8959 681.5049 723.4327 724.9419 756.1537 757.9915 761.3076 843.0001 851.8669 856.4428 878.3927 904.7692 921.4003 941.1290 959.2577 980.0519 981.4233 989.0132 1004.1454 1019.5965 1027.7511 1037.5389 1047.9790 1050.0883 1076.4657 1080.0202 1098.5019 1102.6755 1121.5204 1126.5182 1140.7839 1142.9021 1145.0774 1155.6735 1167.0156 1175.8633 1199.9628 1246.3233 1272.3814 1311.5932 1334.5251 1364.6320 1366.5298 1408.9046 1417.1334 1442.1524 1450.8963 1466.8249 1472.9811 1480.2682 1484.8067 1501.6065 1522.9105 1584.5956 1626.8764 3002.1509 3045.5594 3082.8431 3103.0873 3137.1404 3146.2329 3151.4677 3168.1857 3171.1234 3205.4823 3532.8506
redmass: 13.4390 13.2793 7.2949 16.7990 15.6101 10.0650 9.4909 15.6267 11.8385 9.9145 8.3494 4.8632 1.3170 11.5328 5.0335 4.9841 6.3156 6.3669 9.5003 9.5268 14.1371 5.1009 15.7274 12.8701 11.4517 14.3422 8.5595 8.0893 6.8249 6.3698 4.0453 5.0964 4.4478 6.8323 4.1348 9.2719 3.1253 2.4147 15.4058 6.9157 3.1296 14.4734 13.2527 14.1917 7.7768 7.7716 4.9238 7.3864 4.1621 5.6659 9.9194 7.4462 10.2939 9.7236 10.8178 6.6280 4.2945 3.6204 1.4582 3.1695 1.7567 3.8104 1.4722 5.0953 6.2640 6.1201 3.9529 1.3821 5.1974 7.7031 1.4134 8.9805 5.1924 7.3548 2.7394 6.5057 7.4552 10.3373 8.2898 5.8885 4.7433 9.1376 1.3826 2.3553 7.7343 7.8578 1.6206 9.6772 2.2113 2.1461 2.1862 1.4809 1.6703 1.6330 2.0054 1.4275 2.7941 2.7645 5.9080 1.3078 1.6513 1.4022 2.4338 1.2616 1.3496 1.2461 6.1512 6.7090 7.1486 1.0375 1.0609 1.1023 1.0995 1.0860 1.0962 1.0913 1.0984 1.0688 1.0933 1.0654
irintensity: 0.1226 0.4234 0.5119 0.0159 0.1748 0.1774 0.4571 0.0549 0.2193 0.5879 0.6346 1.9963 1.0024 3.2749 5.8775 0.2114 3.6774 2.3415 0.5273 0.2548 1.9498 0.6941 0.5763 2.0629 4.4116 0.2476 0.4332 0.5483 1.5981 4.5585 12.6470 4.9011 5.3148 5.0149 6.9613 3.8250 11.8170 40.3564 1.8368 23.6938 63.3798 5.2374 1.2628 1.9489 4.2590 1.0509 4.5203 6.8511 2.1531 11.9181 29.3602 20.6871 23.5467 23.7815 1.2834 0.5395 13.3248 3.5446 67.0977 10.5077 38.0367 2.5539 4.1902 133.7925 170.8499 84.6657 89.6674 2.5351 140.2054 18.9650 3.0425 20.3557 39.9976 79.6175 0.5812 1.1306 218.8125 348.1620 88.9566 168.2577 124.5637 70.2959 8.9131 81.7029 129.9453 117.6106 22.9382 344.8577 58.3242 77.9324 29.9859 39.8366 14.9458 52.7821 3.1996 8.7110 4.1526 35.7896 19.2333 26.0746 36.7073 11.1895 26.8125 27.1362 35.3807 22.7762 55.0235 1.9220 2.9534 35.0420 4.3369 13.2778 0.6335 1.9807 6.1848 13.1022 28.5546 679.9028 4.4404 70.4663
temp: 298.150 k
press: 1.00000 atm
elementType: 9 9 9 9 9 9 9 9 9 9 9 9 8 8 7 6 6 6 6 6 6 6 6 6 6 6 6 6 6 6 6 1 1 1 1 1 1 1 1 1 1 1
symmnumber: 1
zpe: 680294.6 jmol-1
zpe.correction: 0.259111 hartree
zpe.thermalcorrener: 0.288015 hartree
zpe.thermalcorrenthalpy: 0.288960 hartree
zpe.thermalcorrgfe: 0.199869 hartree
zpe.sumelectzpe: -2017.296017 hartree
zpe.sumelectthermal: -2017.267112 hartree
zpe.sumelectthermalent: -2017.266168 hartree
zpe.sumelectthermalfe: -2017.355258 hartree
dipole: -2.5248 2.4612 -2.5085
dipole: 4.3272
quadrupole: -190.9885 -158.0110 -183.2886
quadrupole: -2.0609 -7.9638 -7.7002
quadrupole: -13.5591 19.4184 -5.8593 -2.0609 -7.9638 -7.7002
hfenergy: -2017.5551272 hartree
pointgroup: C01 [X(C16H11F12N1O2)]
dipole: 1.1010518 0.965515 0.8682221 debye
polarizability: 235.9328104|20.927273|220.0833204|-23.0486827|4.1246531|131.1087995 unknown
InChI: InChI=1S/C16H11F12NO2/c1-29-8-5-3-2-4-7(8)10(12(31,15(23,24)25)16(26,27)28)9(29)6-11(30,13(17,18)19)14(20,21)22/h2-5,30-31H,6H2,1H3
charge 0 multiplicity 1
42 atoms
F  2.011101 -3.381924 1.23649
F  0.9511 -1.738839 2.381117
F  3.065948 -1.408586 1.654827
F  1.779265 -3.207312 -1.602603
F  3.503453 -1.890825 -0.997228
F  1.899972 -1.094745 -2.390756
F  -2.282519 1.983247 -1.179683
F  -4.257736 0.944491 -1.475517
F  -3.797411 1.9301 0.511063
F  -4.101289 -0.51262 1.92096
F  -3.073099 -2.309349 0.991572
F  -4.791651 -1.311548 -0.083085
O  -0.057917 -2.075506 -0.201268
O  -2.127518 -0.827184 -1.196379
N  0.089103 2.091652 0.660661
C  -0.154176 0.714387 0.574858
C  1.016117 0.088067 0.072365
C  -1.456104 0.119133 1.053792
C  1.230047 -1.403683 -0.028859
C  -2.580737 -0.149209 -0.022607
C  2.011548 1.128421 -0.159958
C  1.385647 2.365929 0.209171
C  1.837359 -1.971862 1.313535
C  2.122408 -1.871864 -1.25608
C  -3.236832 1.161926 -0.550096
C  -3.657859 -1.053989 0.687924
C  -0.79637 3.153824 1.156766
C  3.358083 1.174074 -0.620858
C  2.03333 3.617947 0.118914
C  4.01011 2.416838 -0.711661
C  3.358095 3.630591 -0.350958
H  -1.888161 0.734358 1.86041
H  -1.232793 -0.862684 1.499446
H  -1.086134 3.831292 0.335337
H  -1.715632 2.738088 1.588826
H  -0.274636 3.732311 1.939494
H  3.904738 0.272868 -0.900863
H  1.52624 4.54737 0.395489
H  0.046007 -3.062493 -0.249565
H  -1.293862 -1.351191 -0.964518
H  5.044837 2.451236 -1.068786
H  3.894731 4.580966 -0.439987
